{"text_format":"1","workbook":"xlsx","n_sheets":9,"sheets":["1552_2G_PwrTable","1552_5G_BH_PwrTable","1552_5G_CA_PwrTable","Cover - Guidelines","Client Access & Mesh","Capacity","SLA QoS","Client_Access_&_Mesh","Raw data"],"not_rendered":{"charts":11,"images":2,"macros":1,"external_links":1,"defined_names":5,"comments":1,"pivot_tables":0},"unopened":[],"bounds":{"document_bytes":16777216,"sheet_cells":100000,"rows_first":2000,"rows_last":500,"rows_between":2000,"halvings":0,"cell_chars":16384,"cell_head_chars":4096},"cells_cut":0,"cells_raw":0,"read":"whole","date_system":"1900"}

{"sheet":"1552_2G_PwrTable","index":0,"n_rows":68,"n_cols":62,"rows_kept":68,"cut":false,"hidden":true,"merged":[[11,54,11,61],[11,6,11,13],[11,14,11,21],[11,22,11,29],[11,30,11,37],[11,38,11,45],[11,46,11,53]]}
["DO NOT EDIT: ","This worksheet contain data for the \"1552_ 2GHz_Client_Access\" worksheet."]
[]
[null,null,"SITE 1",null,null,null,null,null,null,null,null,"Allowed Powers List for 1 Tx:",{"$f":"INDEX(A12:BJ68,B9,10)","v":{"$error":"#REF!"}},null,null,"Final List"]
[null,null,null,null,null,null,null,null,null,"Max Power (1 Tx) =",{"$f":"INDEX(A12:BJ68,B8,E8)","v":{"$error":"#REF!"}},null,{"$f":"INDEX(A12:BJ68,B9,9)","v":{"$error":"#REF!"}},null,null,"PL1 =",{"$f":"IF(B6=0,-99,K4+3)","v":{"$error":"#REF!"}}]
["Reg Domain index",{"$f":"#REF!","v":{"$error":"#REF!"}},null,null,null,null,null,null,null,"PL sequence =",{"$f":"MATCH(K4,M3:M10,-1)","v":{"$error":"#REF!"}},null,{"$f":"INDEX(A12:BJ68,B9,8)","v":{"$error":"#REF!"}},null,null,"PL2 =",{"$f":"IF(B6=0,-99,INDEX(M3:M10,K5+1)+3)","v":{"$error":"#REF!"}}]
["Channel index",{"$f":"#REF!","v":{"$error":"#REF!"}},null,null,null,null,null,null,null,null,null,null,{"$f":"INDEX(A12:BJ68,B9,7)","v":{"$error":"#REF!"}},null,null,"PL3 =",{"$f":"IF(B6=0,-99,INDEX(M3:M10,K5+2)+3)","v":{"$error":"#REF!"}}]
["Antenna gain index",{"$f":"#REF!","v":{"$error":"#REF!"}},null,"Rate index",{"$f":"#REF!","v":{"$error":"#REF!"}},null,null,null,null,null,null,null,{"$f":"INDEX(A12:BJ68,B9,6)","v":{"$error":"#REF!"}},null,null,"PL4 =",{"$f":"IF(B6=0,-99,INDEX(M3:M10,K5+3)+3)","v":{"$error":"#REF!"}}]
["Max Pwr Row",{"$f":"IF(B5<5,(-4+6*B5+3*B7), (-10+6*B5+6*B6+3*B7))","v":{"$error":"#REF!"}},null,"Rate Column",{"$f":"IF(E7<5,6,10+E7)","v":{"$error":"#REF!"}},null,null,null,null,null,null,null,{"$f":"INDEX(A12:BJ68,B9,6)","v":{"$error":"#REF!"}},null,null,"PL5 =",{"$f":"IF(B6=0,-99,INDEX(M3:M10,K5+4)+3)","v":{"$error":"#REF!"}}]
["Allowed Pwr Row",{"$f":"B8+1","v":{"$error":"#REF!"}},null,null,null,null,null,null,null,null,null,null,{"$f":"INDEX(A12:BJ68,B9,6)","v":{"$error":"#REF!"}}]
[null,null,null,null,null,null,null,null,null,null,null,null,{"$f":"INDEX(A12:BJ68,B9,6)","v":{"$error":"#REF!"}}]
[1,2,3,4,5,6,7,8,9,10,11,12,13,14,15,16,17,18,19,20,21,22,23,24,25,26,27,28,29,30,31,32,33,34,35,36,37,38]
["Rate Type",null,null,null,null,"CCK","OFDM",null,null,null,null,null,null,null,"LBF",null,null,null,null,null,null,null,"HT20",null,null,null,null,null,null,null,"HT20",null,null,null,null,null,null,null,"HT40",null,null,null,null,null,null,null,"HT40",null,null,null,null,null,null,null,"Non-HT40 Duplicate"]
["Rate Index",null,null,null,null,3,4,5,6,7,8,9,10,11,12,13,14,15,16,17,18,19,20,21,22,23,24,25,26,27,28,29,30,31,32,33,34,35,36,37,38,39,40,41,42,43,44,45,46,47,48,49,50,51,52,53,54,55,56,57,58,59]
[null,"Domain","Start Ch","Stop Ch","Ant Gain","ALL",6,9,12,18,24,36,48,54,6,9,12,18,24,36,48,54,"M0","M1","M2","M3","M4","M5","M6","M7","M8","M9","M10","M11","M12","M13","M14","M15","M0","M1","M2","M3","M4","M5","M6","M7","M8","M9","M10","M11","M12","M13","M14","M15",6,9,12,18,24,36,48,54]
["Single Antenna","E",1,13,2,15,15,15,15,15,15,15,15,15,12,12,12,12,12,12,12,12,15,15,15,15,15,15,15,14,15,15,15,15,15,15,15,14,15,15,15,15,15,15,15,14,15,15,15,15,15,15,15,14,15,15,15,15,15,15,15,14]
["Dual Antenna","E",1,13,2,15,15,15,15,15,15,15,15,15,12,12,12,12,12,12,12,12,15,15,15,15,15,15,15,14,15,15,15,15,15,15,15,14,15,15,15,15,15,15,15,14,15,15,15,15,15,15,15,14,15,15,15,15,15,15,15,14]
["Allowed Powers List","E",1,13,2,3,6,9,12,15,0,0,0,0,0,0,0,0,0,0,0,0,0,0,0,0,0,0,0,0,0,0,0,0,0,0,0,0,0,0,0,0,0,0,0,0,0,0,0,0,0,0,0,0,0,0,0,0,0,0,0,0]
["Single Antenna","E",1,13,4,15,15,15,15,15,15,15,15,15,10,10,10,10,10,10,10,10,15,15,15,15,15,15,15,14,15,15,15,15,15,15,15,14,15,15,15,15,15,15,15,14,15,15,15,15,15,15,15,14,15,15,15,15,15,15,15,14]
["Dual Antenna","E",1,13,4,13,13,13,13,13,13,13,13,13,10,10,10,10,10,10,10,10,13,13,13,13,13,13,13,13,13,13,13,13,13,13,13,13,13,13,13,13,13,13,13,13,13,13,13,13,13,13,13,13,13,13,13,13,13,13,13,13]
["Allowed Powers List","E",1,13,4,3,6,9,12,15,0,0,0,0,0,0,0,0,0,0,0,0,0,0,0,0,0,0,0,0,0,0,0,0,0,0,0,0,0,0,0,0,0,0,0,0,0,0,0,0,0,0,0,0,0,0,0,0,0,0,0,0]
["Single Antenna","K",1,11,2,20,22,22,22,22,22,22,22,22,21,21,21,21,21,21,21,21,22,22,22,22,22,22,22,22,22,22,22,22,22,22,22,22,22,22,22,22,22,22,22,22,22,22,22,22,22,22,22,22,22,22,22,22,22,22,22,22]
["Dual Antenna","K",1,11,2,17,19,19,19,19,19,19,19,19,18,18,18,18,18,18,18,18,19,19,19,19,19,19,19,19,19,19,19,19,19,19,19,19,19,19,19,19,19,19,19,19,19,19,19,19,19,19,19,19,19,19,19,19,19,19,19,19]
["Allowed Powers List","K",1,11,2,13,16,19,22,25,0,0,0,0,0,0,0,0,0,0,0,0,0,0,0,0,0,0,0,0,0,0,0,0,0,0,0,0,0,0,0,0,0,0,0,0,0,0,0,0,0,0,0,0,0,0,0,0,0,0,0,0]
["Single Antenna","K",1,11,4,20,22,22,22,22,22,22,22,22,21,21,21,21,21,21,21,21,22,22,22,22,22,22,22,22,22,22,22,22,22,22,22,22,22,22,22,22,22,22,22,22,22,22,22,22,22,22,22,22,22,22,22,22,22,22,22,22]
["Dual Antenna","K",1,11,4,17,19,19,19,19,19,19,19,19,18,18,18,18,18,18,18,18,19,19,19,19,19,19,19,19,19,19,19,19,19,19,19,19,19,19,19,19,19,19,19,19,19,19,19,19,19,19,19,19,19,19,19,19,19,19,19,19]
["Allowed Powers List","K",1,11,4,13,16,19,22,25,0,0,0,0,0,0,0,0,0,0,0,0,0,0,0,0,0,0,0,0,0,0,0,0,0,0,0,0,0,0,0,0,0,0,0,0,0,0,0,0,0,0,0,0,0,0,0,0,0,0,0,0]
["Single Antenna","Q",1,13,2,15,15,15,15,15,15,15,15,15,15,15,15,15,15,15,15,15,15,15,15,15,15,15,15,14,15,15,15,15,15,15,15,14,15,15,15,15,15,15,15,14,15,15,15,15,15,15,15,14,15,15,15,15,15,15,15,14]
["Dual Antenna","Q",1,13,2,15,15,15,15,15,15,15,15,15,15,15,15,15,15,15,15,15,15,15,15,15,15,15,15,14,15,15,15,15,15,15,15,14,15,15,15,15,15,15,15,14,15,15,15,15,15,15,15,14,15,15,15,15,15,15,15,14]
["Allowed Powers List","Q",1,13,2,3,6,9,12,15,0,0,0,0,0,0,0,0,0,0,0,0,0,0,0,0,0,0,0,0,0,0,0,0,0,0,0,0,0,0,0,0,0,0,0,0,0,0,0,0,0,0,0,0,0,0,0,0,0,0,0,0]
["Single Antenna","Q",1,13,4,15,15,15,15,15,15,15,15,15,14,14,14,14,14,14,14,14,15,15,15,15,15,15,15,14,15,15,15,15,15,15,15,14,15,15,15,15,15,15,15,14,15,15,15,15,15,15,15,14,15,15,15,15,15,15,15,14]
["Dual Antenna","Q",1,13,4,15,15,15,15,15,15,15,15,15,14,14,14,14,14,14,14,14,15,15,15,15,15,15,15,14,15,15,15,15,15,15,15,14,15,15,15,15,15,15,15,14,15,15,15,15,15,15,15,14,15,15,15,15,15,15,15,14]
["Allowed Powers List","Q",1,13,4,3,6,9,12,15,0,0,0,0,0,0,0,0,0,0,0,0,0,0,0,0,0,0,0,0,0,0,0,0,0,0,0,0,0,0,0,0,0,0,0,0,0,0,0,0,0,0,0,0,0,0,0,0,0,0,0,0]
["Single Antenna","R",1,13,2,15,15,15,15,15,15,15,15,15,15,15,15,15,15,15,15,15,15,15,15,15,15,15,15,14,15,15,15,15,15,15,15,14,15,15,15,15,15,15,15,14,15,15,15,15,15,15,15,14,15,15,15,15,15,15,15,14]
["Dual Antenna","R",1,13,2,15,15,15,15,15,15,15,15,15,15,15,15,15,15,15,15,15,15,15,15,15,15,15,15,14,15,15,15,15,15,15,15,14,15,15,15,15,15,15,15,14,15,15,15,15,15,15,15,14,15,15,15,15,15,15,15,14]
["Allowed Powers List","R",1,13,2,3,6,9,12,15,0,0,0,0,0,0,0,0,0,0,0,0,0,0,0,0,0,0,0,0,0,0,0,0,0,0,0,0,0,0,0,0,0,0,0,0,0,0,0,0,0,0,0,0,0,0,0,0,0,0,0,0]
["Single Antenna","R",1,13,4,15,15,15,15,15,15,15,15,15,15,15,15,15,15,15,15,15,15,15,15,15,15,15,15,14,15,15,15,15,15,15,15,14,15,15,15,15,15,15,15,14,15,15,15,15,15,15,15,14,15,15,15,15,15,15,15,14]
["Dual Antenna","R",1,13,4,15,15,15,15,15,15,15,15,15,15,15,15,15,15,15,15,15,15,15,15,15,15,15,15,14,15,15,15,15,15,15,15,14,15,15,15,15,15,15,15,14,15,15,15,15,15,15,15,14,15,15,15,15,15,15,15,14]
["Allowed Powers List","R",1,13,4,3,6,9,12,15,0,0,0,0,0,0,0,0,0,0,0,0,0,0,0,0,0,0,0,0,0,0,0,0,0,0,0,0,0,0,0,0,0,0,0,0,0,0,0,0,0,0,0,0,0,0,0,0,0,0,0,0]
["Single Antenna","A",1,1,2,25,25,25,25,25,25,25,25,25,22,22,22,22,22,22,22,22,24,24,24,24,24,24,24,24,24,24,24,24,24,24,24,24,21,21,21,21,21,21,21,21,21,21,21,21,21,21,21,21,20,20,20,20,20,20,20,20]
["Dual Antenna","A",1,1,2,25,24,24,24,24,24,24,24,24,22,22,22,22,22,22,22,22,23,23,23,23,23,23,23,23,23,23,23,23,23,23,23,23,20,20,20,20,20,20,20,20,20,20,20,20,20,20,20,20,18,18,18,18,18,18,18,18]
["Allowed Powers List","A",1,1,2,13,16,19,22,25,0,0,0,0,0,0,0,0,0,0,0,0,0,0,0,0,0,0,0,0,0,0,0,0,0,0,0,0,0,0,0,0,0,0,0,0,0,0,0,0,0,0,0,0,0,0,0,0,0,0,0,0]
["Single Antenna","A",1,1,4,25,24,24,24,24,24,24,24,24,22,22,22,22,22,22,22,22,23,23,23,23,23,23,23,23,23,23,23,23,23,23,23,23,20,20,20,20,20,20,20,20,20,20,20,20,20,20,20,20,19,19,19,19,19,19,19,19]
["Dual Antenna","A",1,1,4,25,23,23,23,23,23,23,23,23,22,22,22,22,22,22,22,22,22,22,22,22,22,22,22,22,22,22,22,22,22,22,22,22,19,19,19,19,19,19,19,19,19,19,19,19,19,19,19,19,17,17,17,17,17,17,17,17]
["Allowed Powers List","A",1,1,4,13,16,19,22,25,0,0,0,0,0,0,0,0,0,0,0,0,0,0,0,0,0,0,0,0,0,0,0,0,0,0,0,0,0,0,0,0,0,0,0,0,0,0,0,0,0,0,0,0,0,0,0,0,0,0,0,0]
["Single Antenna","A",2,2,2,25,25,25,25,25,25,25,25,25,23,23,23,23,23,23,23,23,25,25,25,25,25,25,25,24,25,25,25,25,25,25,25,24,21,21,21,21,21,21,21,21,21,21,21,21,21,21,21,21,20,20,20,20,20,20,20,20]
["Dual Antenna","A",2,2,2,25,25,25,25,25,25,25,25,25,23,23,23,23,23,23,23,23,24,24,24,24,24,24,24,24,24,24,24,24,24,24,24,24,20,20,20,20,20,20,20,20,20,20,20,20,20,20,20,20,18,18,18,18,18,18,18,18]
["Allowed Powers List","A",2,2,2,13,16,19,22,25,0,0,0,0,0,0,0,0,0,0,0,0,0,0,0,0,0,0,0,0,0,0,0,0,0,0,0,0,0,0,0,0,0,0,0,0,0,0,0,0,0,0,0,0,0,0,0,0,0,0,0,0]
["Single Antenna","A",2,2,4,25,25,25,25,25,25,25,25,25,23,23,23,23,23,23,23,23,24,24,24,24,24,24,24,24,24,24,24,24,24,24,24,24,20,20,20,20,20,20,20,20,20,20,20,20,20,20,20,20,19,19,19,19,19,19,19,19]
["Dual Antenna","A",2,2,4,25,24,24,24,24,24,24,24,24,23,23,23,23,23,23,23,23,23,23,23,23,23,23,23,23,23,23,23,23,23,23,23,23,19,19,19,19,19,19,19,19,19,19,19,19,19,19,19,19,17,17,17,17,17,17,17,17]
["Allowed Powers List","A",2,2,4,13,16,19,22,25,0,0,0,0,0,0,0,0,0,0,0,0,0,0,0,0,0,0,0,0,0,0,0,0,0,0,0,0,0,0,0,0,0,0,0,0,0,0,0,0,0,0,0,0,0,0,0,0,0,0,0,0]
["Single Antenna","A",3,9,2,25,25,25,25,25,25,25,25,25,25,25,25,25,25,25,25,25,25,25,25,25,25,25,25,24,25,25,25,25,25,25,25,24,24,24,24,24,24,24,24,24,24,24,24,24,24,24,24,24,23,23,23,23,23,23,23,23]
["Dual Antenna","A",3,9,2,25,25,25,25,25,25,25,25,25,25,25,25,25,25,25,25,25,25,25,25,25,25,25,25,24,25,25,25,25,25,25,25,24,24,24,24,24,24,24,24,24,24,24,24,24,24,24,24,24,22,22,22,22,22,22,22,22]
["Allowed Powers List","A",3,9,2,13,16,19,22,25,0,0,0,0,0,0,0,0,0,0,0,0,0,0,0,0,0,0,0,0,0,0,0,0,0,0,0,0,0,0,0,0,0,0,0,0,0,0,0,0,0,0,0,0,0,0,0,0,0,0,0,0]
["Single Antenna","A",3,9,4,25,25,25,25,25,25,25,25,25,25,25,25,25,25,25,25,25,25,25,25,25,25,25,25,24,25,25,25,25,25,25,25,24,24,24,24,24,24,24,24,24,24,24,24,24,24,24,24,24,22,22,22,22,22,22,22,22]
["Dual Antenna","A",3,9,4,25,25,25,25,25,25,25,25,25,25,25,25,25,25,25,25,25,25,25,25,25,25,25,25,24,25,25,25,25,25,25,25,24,23,23,23,23,23,23,23,23,23,23,23,23,23,23,23,23,21,21,21,21,21,21,21,21]
["Allowed Powers List","A",3,9,4,13,16,19,22,25,0,0,0,0,0,0,0,0,0,0,0,0,0,0,0,0,0,0,0,0,0,0,0,0,0,0,0,0,0,0,0,0,0,0,0,0,0,0,0,0,0,0,0,0,0,0,0,0,0,0,0,0]
["Single Antenna","A",10,10,2,25,25,25,25,25,25,25,25,25,23,23,23,23,23,23,23,23,25,25,25,25,25,25,25,24,25,25,25,25,25,25,25,24,21,21,21,21,21,21,21,21,21,21,21,21,21,21,21,21,21,21,21,21,21,21,21,21]
["Dual Antenna","A",10,10,2,25,24,24,24,24,24,24,24,24,23,23,23,23,23,23,23,23,24,24,24,24,24,24,24,24,24,24,24,24,24,24,24,24,19,19,19,19,19,19,19,19,19,19,19,19,19,19,19,19,19,19,19,19,19,19,19,19]
["Allowed Powers List","A",10,10,2,13,16,19,22,25,0,0,0,0,0,0,0,0,0,0,0,0,0,0,0,0,0,0,0,0,0,0,0,0,0,0,0,0,0,0,0,0,0,0,0,0,0,0,0,0,0,0,0,0,0,0,0,0,0,0,0,0]
["Single Antenna","A",10,10,4,25,25,25,25,25,25,25,25,25,21,21,21,21,21,21,21,21,24,24,24,24,24,24,24,24,24,24,24,24,24,24,24,24,20,20,20,20,20,20,20,20,20,20,20,20,20,20,20,20,20,20,20,20,20,20,20,20]
["Dual Antenna","A",10,10,4,25,23,23,23,23,23,23,23,23,21,21,21,21,21,21,21,21,23,23,23,23,23,23,23,23,23,23,23,23,23,23,23,23,18,18,18,18,18,18,18,18,18,18,18,18,18,18,18,18,18,18,18,18,18,18,18,18]
["Allowed Powers List","A",10,10,4,13,16,19,22,25,0,0,0,0,0,0,0,0,0,0,0,0,0,0,0,0,0,0,0,0,0,0,0,0,0,0,0,0,0,0,0,0,0,0,0,0,0,0,0,0,0,0,0,0,0,0,0,0,0,0,0,0]
["Single Antenna","A",11,11,2,25,25,25,25,25,25,25,25,25,22,22,22,22,22,22,22,22,25,25,25,25,25,25,25,24,25,25,25,25,25,25,25,24,21,21,21,21,21,21,21,21,21,21,21,21,21,21,21,21,21,21,21,21,21,21,21,21]
["Dual Antenna","A",11,11,2,25,23,23,23,23,23,23,23,23,22,22,22,22,22,22,22,22,23,23,23,23,23,23,23,23,23,23,23,23,23,23,23,23,19,19,19,19,19,19,19,19,19,19,19,19,19,19,19,19,19,19,19,19,19,19,19,19]
["Allowed Powers List","A",11,11,2,13,16,19,22,25,0,0,0,0,0,0,0,0,0,0,0,0,0,0,0,0,0,0,0,0,0,0,0,0,0,0,0,0,0,0,0,0,0,0,0,0,0,0,0,0,0,0,0,0,0,0,0,0,0,0,0,0]
["Single Antenna","A",11,11,4,25,24,24,24,24,24,24,24,24,20,20,20,20,20,20,20,20,24,24,24,24,24,24,24,24,24,24,24,24,24,24,24,24,20,20,20,20,20,20,20,20,20,20,20,20,20,20,20,20,20,20,20,20,20,20,20,20]
["Dual Antenna","A",11,11,4,25,22,22,22,22,22,22,22,22,20,20,20,20,20,20,20,20,22,22,22,22,22,22,22,22,22,22,22,22,22,22,22,22,18,18,18,18,18,18,18,18,18,18,18,18,18,18,18,18,18,18,18,18,18,18,18,18]
["Allowed Powers List","A",11,11,4,13,16,19,22,25,0,0,0,0,0,0,0,0,0,0,0,0,0,0,0,0,0,0,0,0,0,0,0,0,0,0,0,0,0,0,0,0,0,0,0,0,0,0,0,0,0,0,0,0,0,0,0,0,0,0,0,0]

{"sheet":"1552_5G_BH_PwrTable","index":1,"n_rows":202,"n_cols":61,"rows_kept":202,"cut":false,"hidden":true,"merged":[[19,53,19,60],[19,5,19,12],[19,13,19,20],[19,21,19,28],[19,29,19,36],[19,37,19,44],[19,45,19,52]]}
["DO NOT EDIT: ","This worksheet contain data for the \"1552_Backhaul\" worksheet."]
[]
[null,null,"SITE 1",null,null,null,null,null,null,null,null,"Allowed Powers List for 1 Tx:",{"$f":"INDEX(A20:BI202,B9,9)","v":{"$error":"#REF!"}},null,null,"Final List"]
[null,null,null,null,null,null,null,null,null,"Max Power (1 Tx) =",{"$f":"INDEX(A20:BI202,B8,E8)","v":{"$error":"#REF!"}},null,{"$f":"INDEX(A20:BI202,B9,8)","v":{"$error":"#REF!"}},null,null,"PL1 =",{"$f":"K4+3","v":{"$error":"#REF!"}}]
["Reg Domain index",{"$f":"#REF!","v":{"$error":"#REF!"}},null,null,null,null,null,null,null,"PL sequence =",{"$f":"MATCH(K4,M3:M10,-1)","v":{"$error":"#REF!"}},null,{"$f":"INDEX(A20:BI202,B9,7)","v":{"$error":"#REF!"}},null,null,"PL2 =",{"$f":"INDEX(M3:M10,K5+1)+3","v":{"$error":"#REF!"}}]
["Channel index",{"$f":"#REF!","v":{"$error":"#REF!"}},null,null,null,null,null,null,null,null,null,null,{"$f":"INDEX(A20:BI202,B9,6)","v":{"$error":"#REF!"}},null,null,"PL3 =",{"$f":"INDEX(M3:M10,K5+2)+3","v":{"$error":"#REF!"}}]
["Antenna gain index",{"$f":"#REF!","v":{"$error":"#REF!"}},null,"Rate index",{"$f":"#REF!","v":{"$error":"#REF!"}},null,null,null,null,null,null,null,{"$f":"INDEX(A20:BI202,B9,5)","v":{"$error":"#REF!"}},null,null,"PL4 =",{"$f":"INDEX(M3:M10,K5+3)+3","v":{"$error":"#REF!"}}]
["Max Pwr Row",{"$f":"-22+18*B5+6*B6+3*B7","v":{"$error":"#REF!"}},null,"Rate Column",{"$f":"13+E7","v":{"$error":"#REF!"}},null,null,null,null,null,null,null,{"$f":"INDEX(A20:BI202,B9,5)","v":{"$error":"#REF!"}},null,null,"PL5 =",{"$f":"INDEX(M3:M10,K5+4)+3","v":{"$error":"#REF!"}}]
["Allowed Pwr Row",{"$f":"B8+1","v":{"$error":"#REF!"}},null,null,null,null,null,null,null,null,null,null,{"$f":"INDEX(A20:BI202,B9,5)","v":{"$error":"#REF!"}}]
[null,null,null,null,null,null,null,null,null,null,null,null,{"$f":"INDEX(A20:BI202,B9,5)","v":{"$error":"#REF!"}}]
[null,null,"SITE 2",null,null,null,null,null,null,null,null,"Allowed Powers List for 1 Tx:",{"$f":"INDEX(A20:BI202,B17,9)","v":{"$error":"#REF!"}},null,null,"Final List"]
[null,null,null,null,null,null,null,null,null,"Max Power (1Tx) =",{"$f":"INDEX(A20:BI202,B16,E16)","v":{"$error":"#REF!"}},null,{"$f":"INDEX(A20:BI202,B17,8)","v":{"$error":"#REF!"}},null,null,"PL1 =",{"$f":"K12+3","v":{"$error":"#REF!"}}]
["Reg Domain index",{"$f":"#REF!","v":{"$error":"#REF!"}},null,null,null,null,null,null,null,"PL sequence =",{"$f":"MATCH(K12,M11:M18,-1)","v":{"$error":"#REF!"}},null,{"$f":"INDEX(A20:BI202,B17,7)","v":{"$error":"#REF!"}},null,null,"PL2 =",{"$f":"INDEX(M11:M18,K13+1)+3","v":{"$error":"#REF!"}}]
["Channel index",{"$f":"#REF!","v":{"$error":"#REF!"}},null,null,null,null,null,null,null,null,null,null,{"$f":"INDEX(A20:BI202,B17,6)","v":{"$error":"#REF!"}},null,null,"PL3 =",{"$f":"INDEX(M11:M18,K13+2)+3","v":{"$error":"#REF!"}}]
["Antenna gain index",{"$f":"#REF!","v":{"$error":"#REF!"}},null,"Rate index",{"$f":"#REF!","v":{"$error":"#REF!"}},null,null,null,null,null,null,null,{"$f":"INDEX(A20:BI202,B17,5)","v":{"$error":"#REF!"}},null,null,"PL4 =",{"$f":"INDEX(M11:M18,K13+3)+3","v":{"$error":"#REF!"}}]
["Max Pwr Row",{"$f":"-22+18*B13+6*B14+3*B15","v":{"$error":"#REF!"}},null,"Rate Column",{"$f":"13+E15","v":{"$error":"#REF!"}},null,null,null,null,null,null,null,{"$f":"INDEX(A20:BI202,B17,5)","v":{"$error":"#REF!"}},null,null,"PL5 =",{"$f":"INDEX(M11:M18,K13+4)+3","v":{"$error":"#REF!"}}]
["Allowed Pwr Row",{"$f":"B16+1","v":{"$error":"#REF!"}},null,null,null,null,null,null,null,null,null,null,{"$f":"INDEX(A20:BI202,B17,5)","v":{"$error":"#REF!"}}]
[null,null,null,null,null,null,null,null,null,null,null,null,{"$f":"INDEX(A20:BI2010,B17,5)","v":{"$error":"#REF!"}}]
[]
["Rate Type",null,null,null,"CCK","OFDM",null,null,null,null,null,null,null,"LBF",null,null,null,null,null,null,null,"HT20",null,null,null,null,null,null,null,"HT20",null,null,null,null,null,null,null,"HT40",null,null,null,null,null,null,null,"HT40",null,null,null,null,null,null,null,"Non-HT40 Duplicate"]
["Rate Index",null,null,null,0,0,0,0,0,0,0,0,0,1,2,3,4,5,6,7,8,9,10,11,12,13,14,15,16,17,18,19,20,21,22,23,24,25,26,27,28,29,30,31,32,33,34,35,36,37,38,39,40,0,0,0,0,0,0,0,0]
[null,"Reg Domain","Channel","Ant Gain","ALL",6,9,12,18,24,36,48,54,6,9,12,18,24,36,48,54,"M0","M1","M2","M3","M4","M5","M6","M7","M8","M9","M10","M11","M12","M13","M14","M15","M0","M1","M2","M3","M4","M5","M6","M7","M8","M9","M10","M11","M12","M13","M14","M15",6,9,12,18,24,36,48,54]
["Single Antenna","A","Unii 2",4,-99,-99,-99,-99,-99,-99,-99,-99,-99,-99,-99,-99,-99,-99,-99,-99,-99,-99,-99,-99,-99,-99,-99,-99,-99,-99,-99,-99,-99,-99,-99,-99,-99,-99,-99,-99,-99,-99,-99,-99,-99,-99,-99,-99,-99,-99,-99,-99,-99,-99,-99,-99,-99,-99,-99,-99,-99]
["Dual Antenna","A","Unii 2",4,-99,-99,-99,-99,-99,-99,-99,-99,-99,-99,-99,-99,-99,-99,-99,-99,-99,-99,-99,-99,-99,-99,-99,-99,-99,-99,-99,-99,-99,-99,-99,-99,-99,-99,-99,-99,-99,-99,-99,-99,-99,-99,-99,-99,-99,-99,-99,-99,-99,-99,-99,-99,-99,-99,-99,-99,-99]
["Allowed Powers List","A","Unii 2",4,-99,-99,-99,-99,-99,-99,-99,-99,-99,-99,-99,-99,-99,-99,-99,-99,-99,-99,-99,-99,-99,-99,-99,-99,-99,-99,-99,-99,-99,-99,-99,-99,-99,-99,-99,-99,-99,-99,-99,-99,-99,-99,-99,-99,-99,-99,-99,-99,-99,-99,-99,-99,-99,-99,-99,-99,-99]
["Single Antenna","A","Unii 2",7,-99,-99,-99,-99,-99,-99,-99,-99,-99,-99,-99,-99,-99,-99,-99,-99,-99,-99,-99,-99,-99,-99,-99,-99,-99,-99,-99,-99,-99,-99,-99,-99,-99,-99,-99,-99,-99,-99,-99,-99,-99,-99,-99,-99,-99,-99,-99,-99,-99,-99,-99,-99,-99,-99,-99,-99,-99]
["Dual Antenna","A","Unii 2",7,-99,-99,-99,-99,-99,-99,-99,-99,-99,-99,-99,-99,-99,-99,-99,-99,-99,-99,-99,-99,-99,-99,-99,-99,-99,-99,-99,-99,-99,-99,-99,-99,-99,-99,-99,-99,-99,-99,-99,-99,-99,-99,-99,-99,-99,-99,-99,-99,-99,-99,-99,-99,-99,-99,-99,-99,-99]
["Allowed Powers List","A","Unii 2",7,-99,-99,-99,-99,-99,-99,-99,-99,-99,-99,-99,-99,-99,-99,-99,-99,-99,-99,-99,-99,-99,-99,-99,-99,-99,-99,-99,-99,-99,-99,-99,-99,-99,-99,-99,-99,-99,-99,-99,-99,-99,-99,-99,-99,-99,-99,-99,-99,-99,-99,-99,-99,-99,-99,-99,-99,-99]
["Single Antenna","A","Unii 2ext",4,-99,-99,-99,-99,-99,-99,-99,-99,-99,-99,-99,-99,-99,-99,-99,-99,-99,-99,-99,-99,-99,-99,-99,-99,-99,-99,-99,-99,-99,-99,-99,-99,-99,-99,-99,-99,-99,-99,-99,-99,-99,-99,-99,-99,-99,-99,-99,-99,-99,-99,-99,-99,-99,-99,-99,-99,-99]
["Dual Antenna","A","Unii 2ext",4,-99,-99,-99,-99,-99,-99,-99,-99,-99,-99,-99,-99,-99,-99,-99,-99,-99,-99,-99,-99,-99,-99,-99,-99,-99,-99,-99,-99,-99,-99,-99,-99,-99,-99,-99,-99,-99,-99,-99,-99,-99,-99,-99,-99,-99,-99,-99,-99,-99,-99,-99,-99,-99,-99,-99,-99,-99]
["Allowed Powers List","A","Unii 2ext",4,-99,-99,-99,-99,-99,-99,-99,-99,-99,-99,-99,-99,-99,-99,-99,-99,-99,-99,-99,-99,-99,-99,-99,-99,-99,-99,-99,-99,-99,-99,-99,-99,-99,-99,-99,-99,-99,-99,-99,-99,-99,-99,-99,-99,-99,-99,-99,-99,-99,-99,-99,-99,-99,-99,-99,-99,-99]
["Single Antenna","A","Unii 2ext",7,-99,-99,-99,-99,-99,-99,-99,-99,-99,-99,-99,-99,-99,-99,-99,-99,-99,-99,-99,-99,-99,-99,-99,-99,-99,-99,-99,-99,-99,-99,-99,-99,-99,-99,-99,-99,-99,-99,-99,-99,-99,-99,-99,-99,-99,-99,-99,-99,-99,-99,-99,-99,-99,-99,-99,-99,-99]
["Dual Antenna","A","Unii 2ext",7,-99,-99,-99,-99,-99,-99,-99,-99,-99,-99,-99,-99,-99,-99,-99,-99,-99,-99,-99,-99,-99,-99,-99,-99,-99,-99,-99,-99,-99,-99,-99,-99,-99,-99,-99,-99,-99,-99,-99,-99,-99,-99,-99,-99,-99,-99,-99,-99,-99,-99,-99,-99,-99,-99,-99,-99,-99]
["Allowed Powers List","A","Unii 2ext",7,-99,-99,-99,-99,-99,-99,-99,-99,-99,-99,-99,-99,-99,-99,-99,-99,-99,-99,-99,-99,-99,-99,-99,-99,-99,-99,-99,-99,-99,-99,-99,-99,-99,-99,-99,-99,-99,-99,-99,-99,-99,-99,-99,-99,-99,-99,-99,-99,-99,-99,-99,-99,-99,-99,-99,-99,-99]
["Single Antenna","A","Upper ISM",4,0,25,25,25,25,25,24,23,22,0,0,0,0,0,0,0,0,24,24,24,24,24,23,22,20,0,0,0,0,0,0,0,0,24,24,24,24,24,23,22,20,0,0,0,0,0,0,0,0,25,25,25,25,25,24,23,22]
["Dual Antenna","A","Upper ISM",4,0,25,25,25,25,25,24,23,22,25,25,25,25,25,24,23,22,24,24,24,24,24,23,22,20,24,24,24,24,24,23,22,20,24,24,24,24,24,23,22,20,24,24,24,24,24,23,22,20,25,25,25,25,25,24,23,22]
["Allowed Powers List","A","Upper ISM",4,13,16,19,22,25,0,0,0,0,0,0,0,0,0,0,0,0,0,0,0,0,0,0,0,0,0,0,0,0,0,0,0,0,0,0,0,0,0,0,0,0,0,0,0,0,0,0,0,0,0,0,0,0,0,0,0,0]
["Single Antenna","A","Upper ISM",7,0,25,25,25,25,25,24,23,22,0,0,0,0,0,0,0,0,24,24,24,24,24,23,22,20,0,0,0,0,0,0,0,0,24,24,24,24,24,23,22,20,0,0,0,0,0,0,0,0,25,25,25,25,25,24,23,22]
["Dual Antenna","A","Upper ISM",7,0,25,25,25,25,25,24,23,22,23,23,23,23,23,23,23,22,24,24,24,24,24,23,22,20,24,24,24,24,24,23,22,20,24,24,24,24,24,23,22,20,24,24,24,24,24,23,22,20,25,25,25,25,25,24,23,22]
["Allowed Powers List","A","Upper ISM",7,13,16,19,22,25,0,0,0,0,0,0,0,0,0,0,0,0,0,0,0,0,0,0,0,0,0,0,0,0,0,0,0,0,0,0,0,0,0,0,0,0,0,0,0,0,0,0,0,0,0,0,0,0,0,0,0,0]
["Single Antenna","C","Unii 2",4,-99,-99,-99,-99,-99,-99,-99,-99,-99,-99,-99,-99,-99,-99,-99,-99,-99,-99,-99,-99,-99,-99,-99,-99,-99,-99,-99,-99,-99,-99,-99,-99,-99,-99,-99,-99,-99,-99,-99,-99,-99,-99,-99,-99,-99,-99,-99,-99,-99,-99,-99,-99,-99,-99,-99,-99,-99]
["Dual Antenna","C","Unii 2",4,-99,-99,-99,-99,-99,-99,-99,-99,-99,-99,-99,-99,-99,-99,-99,-99,-99,-99,-99,-99,-99,-99,-99,-99,-99,-99,-99,-99,-99,-99,-99,-99,-99,-99,-99,-99,-99,-99,-99,-99,-99,-99,-99,-99,-99,-99,-99,-99,-99,-99,-99,-99,-99,-99,-99,-99,-99]
["Allowed Powers List","C","Unii 2",4,-99,-99,-99,-99,-99,-99,-99,-99,-99,-99,-99,-99,-99,-99,-99,-99,-99,-99,-99,-99,-99,-99,-99,-99,-99,-99,-99,-99,-99,-99,-99,-99,-99,-99,-99,-99,-99,-99,-99,-99,-99,-99,-99,-99,-99,-99,-99,-99,-99,-99,-99,-99,-99,-99,-99,-99,-99]
["Single Antenna","C","Unii 2",7,-99,-99,-99,-99,-99,-99,-99,-99,-99,-99,-99,-99,-99,-99,-99,-99,-99,-99,-99,-99,-99,-99,-99,-99,-99,-99,-99,-99,-99,-99,-99,-99,-99,-99,-99,-99,-99,-99,-99,-99,-99,-99,-99,-99,-99,-99,-99,-99,-99,-99,-99,-99,-99,-99,-99,-99,-99]
["Dual Antenna","C","Unii 2",7,-99,-99,-99,-99,-99,-99,-99,-99,-99,-99,-99,-99,-99,-99,-99,-99,-99,-99,-99,-99,-99,-99,-99,-99,-99,-99,-99,-99,-99,-99,-99,-99,-99,-99,-99,-99,-99,-99,-99,-99,-99,-99,-99,-99,-99,-99,-99,-99,-99,-99,-99,-99,-99,-99,-99,-99,-99]
["Allowed Powers List","C","Unii 2",7,-99,-99,-99,-99,-99,-99,-99,-99,-99,-99,-99,-99,-99,-99,-99,-99,-99,-99,-99,-99,-99,-99,-99,-99,-99,-99,-99,-99,-99,-99,-99,-99,-99,-99,-99,-99,-99,-99,-99,-99,-99,-99,-99,-99,-99,-99,-99,-99,-99,-99,-99,-99,-99,-99,-99,-99,-99]
["Single Antenna","C","Unii 2ext",4,-99,-99,-99,-99,-99,-99,-99,-99,-99,-99,-99,-99,-99,-99,-99,-99,-99,-99,-99,-99,-99,-99,-99,-99,-99,-99,-99,-99,-99,-99,-99,-99,-99,-99,-99,-99,-99,-99,-99,-99,-99,-99,-99,-99,-99,-99,-99,-99,-99,-99,-99,-99,-99,-99,-99,-99,-99]
["Dual Antenna","C","Unii 2ext",4,-99,-99,-99,-99,-99,-99,-99,-99,-99,-99,-99,-99,-99,-99,-99,-99,-99,-99,-99,-99,-99,-99,-99,-99,-99,-99,-99,-99,-99,-99,-99,-99,-99,-99,-99,-99,-99,-99,-99,-99,-99,-99,-99,-99,-99,-99,-99,-99,-99,-99,-99,-99,-99,-99,-99,-99,-99]
["Allowed Powers List","C","Unii 2ext",4,-99,-99,-99,-99,-99,-99,-99,-99,-99,-99,-99,-99,-99,-99,-99,-99,-99,-99,-99,-99,-99,-99,-99,-99,-99,-99,-99,-99,-99,-99,-99,-99,-99,-99,-99,-99,-99,-99,-99,-99,-99,-99,-99,-99,-99,-99,-99,-99,-99,-99,-99,-99,-99,-99,-99,-99,-99]
["Single Antenna","C","Unii 2ext",7,-99,-99,-99,-99,-99,-99,-99,-99,-99,-99,-99,-99,-99,-99,-99,-99,-99,-99,-99,-99,-99,-99,-99,-99,-99,-99,-99,-99,-99,-99,-99,-99,-99,-99,-99,-99,-99,-99,-99,-99,-99,-99,-99,-99,-99,-99,-99,-99,-99,-99,-99,-99,-99,-99,-99,-99,-99]
["Dual Antenna","C","Unii 2ext",7,-99,-99,-99,-99,-99,-99,-99,-99,-99,-99,-99,-99,-99,-99,-99,-99,-99,-99,-99,-99,-99,-99,-99,-99,-99,-99,-99,-99,-99,-99,-99,-99,-99,-99,-99,-99,-99,-99,-99,-99,-99,-99,-99,-99,-99,-99,-99,-99,-99,-99,-99,-99,-99,-99,-99,-99,-99]
["Allowed Powers List","C","Unii 2ext",7,-99,-99,-99,-99,-99,-99,-99,-99,-99,-99,-99,-99,-99,-99,-99,-99,-99,-99,-99,-99,-99,-99,-99,-99,-99,-99,-99,-99,-99,-99,-99,-99,-99,-99,-99,-99,-99,-99,-99,-99,-99,-99,-99,-99,-99,-99,-99,-99,-99,-99,-99,-99,-99,-99,-99,-99,-99]
["Single Antenna","C","Upper ISM",4,0,25,25,25,25,25,24,23,22,0,0,0,0,0,0,0,0,24,24,24,23,23,23,22,20,0,0,0,0,0,0,0,0,23,23,23,23,23,23,22,20,0,0,0,0,0,0,0,0,25,25,25,25,25,24,23,22]
["Dual Antenna","C","Upper ISM",4,0,23,23,23,23,23,23,23,22,20,20,20,20,20,20,20,20,23,23,23,23,23,23,22,20,23,23,23,23,23,23,22,20,23,23,23,23,23,23,22,20,23,23,23,23,23,23,22,20,23,23,23,23,23,23,23,22]
["Allowed Powers List","C","Upper ISM",4,13,16,19,22,25,0,0,0,0,0,0,0,0,0,0,0,0,0,0,0,0,0,0,0,0,0,0,0,0,0,0,0,0,0,0,0,0,0,0,0,0,0,0,0,0,0,0,0,0,0,0,0,0,0,0,0,0]
["Single Antenna","C","Upper ISM",7,0,23,23,23,23,23,23,23,22,0,0,0,0,0,0,0,0,23,23,23,23,23,23,22,20,0,0,0,0,0,0,0,0,23,23,23,23,23,23,22,20,0,0,0,0,0,0,0,0,23,23,23,23,23,23,22,20]
["Dual Antenna","C","Upper ISM",7,0,20,20,20,20,20,20,20,20,17,17,17,17,17,17,17,17,20,20,20,20,20,20,20,20,20,20,20,20,20,20,20,20,20,20,20,20,20,20,20,20,20,20,20,20,20,20,20,20,20,20,20,20,20,20,20,20]
["Allowed Powers List","C","Upper ISM",7,13,16,19,22,25,0,0,0,0,0,0,0,0,0,0,0,0,0,0,0,0,0,0,0,0,0,0,0,0,0,0,0,0,0,0,0,0,0,0,0,0,0,0,0,0,0,0,0,0,0,0,0,0,0,0,0,0]
["Single Antenna","E","Unii 2",4,-99,-99,-99,-99,-99,-99,-99,-99,-99,-99,-99,-99,-99,-99,-99,-99,-99,-99,-99,-99,-99,-99,-99,-99,-99,-99,-99,-99,-99,-99,-99,-99,-99,-99,-99,-99,-99,-99,-99,-99,-99,-99,-99,-99,-99,-99,-99,-99,-99,-99,-99,-99,-99,-99,-99,-99,-99]
["Dual Antenna","E","Unii 2",4,-99,-99,-99,-99,-99,-99,-99,-99,-99,-99,-99,-99,-99,-99,-99,-99,-99,-99,-99,-99,-99,-99,-99,-99,-99,-99,-99,-99,-99,-99,-99,-99,-99,-99,-99,-99,-99,-99,-99,-99,-99,-99,-99,-99,-99,-99,-99,-99,-99,-99,-99,-99,-99,-99,-99,-99,-99]
["Allowed Powers List","E","Unii 2",4,-99,-99,-99,-99,-99,-99,-99,-99,-99,-99,-99,-99,-99,-99,-99,-99,-99,-99,-99,-99,-99,-99,-99,-99,-99,-99,-99,-99,-99,-99,-99,-99,-99,-99,-99,-99,-99,-99,-99,-99,-99,-99,-99,-99,-99,-99,-99,-99,-99,-99,-99,-99,-99,-99,-99,-99,-99]
["Single Antenna","E","Unii 2",7,-99,-99,-99,-99,-99,-99,-99,-99,-99,-99,-99,-99,-99,-99,-99,-99,-99,-99,-99,-99,-99,-99,-99,-99,-99,-99,-99,-99,-99,-99,-99,-99,-99,-99,-99,-99,-99,-99,-99,-99,-99,-99,-99,-99,-99,-99,-99,-99,-99,-99,-99,-99,-99,-99,-99,-99,-99]
["Dual Antenna","E","Unii 2",7,-99,-99,-99,-99,-99,-99,-99,-99,-99,-99,-99,-99,-99,-99,-99,-99,-99,-99,-99,-99,-99,-99,-99,-99,-99,-99,-99,-99,-99,-99,-99,-99,-99,-99,-99,-99,-99,-99,-99,-99,-99,-99,-99,-99,-99,-99,-99,-99,-99,-99,-99,-99,-99,-99,-99,-99,-99]
["Allowed Powers List","E","Unii 2",7,-99,-99,-99,-99,-99,-99,-99,-99,-99,-99,-99,-99,-99,-99,-99,-99,-99,-99,-99,-99,-99,-99,-99,-99,-99,-99,-99,-99,-99,-99,-99,-99,-99,-99,-99,-99,-99,-99,-99,-99,-99,-99,-99,-99,-99,-99,-99,-99,-99,-99,-99,-99,-99,-99,-99,-99,-99]
["Single Antenna","E","Unii 2ext",4,0,23,23,23,23,23,23,23,22,0,0,0,0,0,0,0,0,23,23,23,23,23,23,22,20,0,0,0,0,0,0,0,0,23,23,23,23,23,23,22,20,0,0,0,0,0,0,0,0,23,23,23,23,23,23,23,22]
["Dual Antenna","E","Unii 2ext",4,0,22,22,22,22,22,22,22,22,19,19,19,19,19,19,19,19,22,22,22,22,22,22,22,20,22,22,22,22,22,22,22,20,23,23,23,23,23,23,22,20,23,23,23,23,23,23,22,20,23,23,23,23,23,23,23,22]
["Allowed Powers List","E","Unii 2ext",4,7,11,17,20,23,0,0,0,0,0,0,0,0,0,0,0,0,0,0,0,0,0,0,0,0,0,0,0,0,0,0,0,0,0,0,0,0,0,0,0,0,0,0,0,0,0,0,0,0,0,0,0,0,0,0,0,0]
["Single Antenna","E","Unii 2ext",7,0,22,22,22,22,22,22,22,22,0,0,0,0,0,0,0,0,22,22,22,22,22,22,22,20,0,0,0,0,0,0,0,0,23,23,23,23,23,23,22,20,0,0,0,0,0,0,0,0,23,23,23,23,23,23,23,22]
["Dual Antenna","E","Unii 2ext",7,0,19,19,19,19,19,19,19,19,16,16,16,16,16,16,16,16,19,19,19,19,19,19,19,19,19,19,19,19,19,19,19,19,20,20,20,20,20,20,20,20,20,20,20,20,20,20,20,20,20,20,20,20,20,20,20,20]
["Allowed Powers List","E","Unii 2ext",7,7,11,17,20,23,0,0,0,0,0,0,0,0,0,0,0,0,0,0,0,0,0,0,0,0,0,0,0,0,0,0,0,0,0,0,0,0,0,0,0,0,0,0,0,0,0,0,0,0,0,0,0,0,0,0,0,0]
["Single Antenna","E","Upper ISM",4,-99,-99,-99,-99,-99,-99,-99,-99,-99,-99,-99,-99,-99,-99,-99,-99,-99,-99,-99,-99,-99,-99,-99,-99,-99,-99,-99,-99,-99,-99,-99,-99,-99,-99,-99,-99,-99,-99,-99,-99,-99,-99,-99,-99,-99,-99,-99,-99,-99,-99,-99,-99,-99,-99,-99,-99,-99]
["Dual Antenna","E","Upper ISM",4,-99,-99,-99,-99,-99,-99,-99,-99,-99,-99,-99,-99,-99,-99,-99,-99,-99,-99,-99,-99,-99,-99,-99,-99,-99,-99,-99,-99,-99,-99,-99,-99,-99,-99,-99,-99,-99,-99,-99,-99,-99,-99,-99,-99,-99,-99,-99,-99,-99,-99,-99,-99,-99,-99,-99,-99,-99]
["Allowed Powers List","E","Upper ISM",4,-99,-99,-99,-99,-99,-99,-99,-99,-99,-99,-99,-99,-99,-99,-99,-99,-99,-99,-99,-99,-99,-99,-99,-99,-99,-99,-99,-99,-99,-99,-99,-99,-99,-99,-99,-99,-99,-99,-99,-99,-99,-99,-99,-99,-99,-99,-99,-99,-99,-99,-99,-99,-99,-99,-99,-99,-99]
["Single Antenna","E","Upper ISM",7,-99,-99,-99,-99,-99,-99,-99,-99,-99,-99,-99,-99,-99,-99,-99,-99,-99,-99,-99,-99,-99,-99,-99,-99,-99,-99,-99,-99,-99,-99,-99,-99,-99,-99,-99,-99,-99,-99,-99,-99,-99,-99,-99,-99,-99,-99,-99,-99,-99,-99,-99,-99,-99,-99,-99,-99,-99]
["Dual Antenna","E","Upper ISM",7,-99,-99,-99,-99,-99,-99,-99,-99,-99,-99,-99,-99,-99,-99,-99,-99,-99,-99,-99,-99,-99,-99,-99,-99,-99,-99,-99,-99,-99,-99,-99,-99,-99,-99,-99,-99,-99,-99,-99,-99,-99,-99,-99,-99,-99,-99,-99,-99,-99,-99,-99,-99,-99,-99,-99,-99,-99]
["Allowed Powers List","E","Upper ISM",7,-99,-99,-99,-99,-99,-99,-99,-99,-99,-99,-99,-99,-99,-99,-99,-99,-99,-99,-99,-99,-99,-99,-99,-99,-99,-99,-99,-99,-99,-99,-99,-99,-99,-99,-99,-99,-99,-99,-99,-99,-99,-99,-99,-99,-99,-99,-99,-99,-99,-99,-99,-99,-99,-99,-99,-99,-99]
["Single Antenna","K","Unii 2",4,0,22,22,22,22,22,22,22,22,0,0,0,0,0,0,0,0,22,22,22,22,22,22,22,20,0,0,0,0,0,0,0,0,22,22,22,22,22,22,22,20,0,0,0,0,0,0,0,0,22,22,22,22,22,22,22,20]
["Dual Antenna","K","Unii 2",4,0,19,19,19,19,19,19,19,19,16,16,16,16,16,16,16,16,19,19,19,19,19,19,19,19,19,19,19,19,19,19,19,19,19,19,19,19,19,19,19,19,19,19,19,19,19,19,19,19,19,19,19,19,19,19,19,19]
["Allowed Powers List","K","Unii 2",4,7,11,17,20,23,0,0,0,0,0,0,0,0,0,0,0,0,0,0,0,0,0,0,0,0,0,0,0,0,0,0,0,0,0,0,0,0,0,0,0,0,0,0,0,0,0,0,0,0,0,0,0,0,0,0,0,0]
["Single Antenna","K","Unii 2",7,0,19,19,19,19,19,19,19,19,0,0,0,0,0,0,0,0,19,19,19,19,19,19,19,19,0,0,0,0,0,0,0,0,19,19,19,19,19,19,19,19,0,0,0,0,0,0,0,0,19,19,19,19,19,19,19,19]
["Dual Antenna","K","Unii 2",7,0,16,16,16,16,16,16,16,16,13,13,13,13,13,13,13,13,16,16,16,16,16,16,16,16,16,16,16,16,16,16,16,16,16,16,16,16,16,16,16,16,16,16,16,16,16,16,16,16,16,16,16,16,16,16,16,16]
["Allowed Powers List","K","Unii 2",7,7,11,17,20,23,0,0,0,0,0,0,0,0,0,0,0,0,0,0,0,0,0,0,0,0,0,0,0,0,0,0,0,0,0,0,0,0,0,0,0,0,0,0,0,0,0,0,0,0,0,0,0,0,0,0,0,0]
["Single Antenna","K","Unii 2ext",4,0,22,22,22,22,22,22,22,22,0,0,0,0,0,0,0,0,22,22,22,22,22,22,22,20,0,0,0,0,0,0,0,0,22,22,22,22,22,22,22,20,0,0,0,0,0,0,0,0,22,22,22,22,22,22,22,20]
["Dual Antenna","K","Unii 2ext",4,0,19,19,19,19,19,19,19,19,16,16,16,16,16,16,16,16,19,19,19,19,19,19,19,19,19,19,19,19,19,19,19,19,19,19,19,19,19,19,19,19,19,19,19,19,19,19,19,19,19,19,19,19,19,19,19,19]
["Allowed Powers List","K","Unii 2ext",4,7,11,17,20,23,0,0,0,0,0,0,0,0,0,0,0,0,0,0,0,0,0,0,0,0,0,0,0,0,0,0,0,0,0,0,0,0,0,0,0,0,0,0,0,0,0,0,0,0,0,0,0,0,0,0,0,0]
["Single Antenna","K","Unii 2ext",7,0,19,19,19,19,19,19,19,19,0,0,0,0,0,0,0,0,19,19,19,19,19,19,19,19,0,0,0,0,0,0,0,0,19,19,19,19,19,19,19,19,0,0,0,0,0,0,0,0,19,19,19,19,19,19,19,19]
["Dual Antenna","K","Unii 2ext",7,0,16,16,16,16,16,16,16,16,13,13,13,13,13,13,13,13,16,16,16,16,16,16,16,16,16,16,16,16,16,16,16,16,16,16,16,16,16,16,16,16,16,16,16,16,16,16,16,16,16,16,16,16,16,16,16,16]
["Allowed Powers List","K","Unii 2ext",7,7,11,17,20,23,0,0,0,0,0,0,0,0,0,0,0,0,0,0,0,0,0,0,0,0,0,0,0,0,0,0,0,0,0,0,0,0,0,0,0,0,0,0,0,0,0,0,0,0,0,0,0,0,0,0,0,0]
["Single Antenna","K","Upper ISM",4,0,19,19,19,19,19,19,19,19,0,0,0,0,0,0,0,0,19,19,19,19,19,19,19,19,0,0,0,0,0,0,0,0,19,19,19,19,19,19,19,19,0,0,0,0,0,0,0,0,19,19,19,19,19,19,19,19]
["Dual Antenna","K","Upper ISM",4,0,19,19,19,19,19,19,19,19,18,18,18,18,18,18,18,18,19,19,19,19,19,19,19,19,19,19,19,19,19,19,19,19,19,19,19,19,19,19,19,19,19,19,19,19,19,19,19,19,19,19,19,19,19,19,19,19]
["Allowed Powers List","K","Upper ISM",4,13,16,19,22,25,0,0,0,0,0,0,0,0,0,0,0,0,0,0,0,0,0,0,0,0,0,0,0,0,0,0,0,0,0,0,0,0,0,0,0,0,0,0,0,0,0,0,0,0,0,0,0,0,0,0,0,0]
["Single Antenna","K","Upper ISM",7,0,19,19,19,19,19,19,19,19,0,0,0,0,0,0,0,0,19,19,19,19,19,19,19,19,0,0,0,0,0,0,0,0,19,19,19,19,19,19,19,19,0,0,0,0,0,0,0,0,19,19,19,19,19,19,19,19]
["Dual Antenna","K","Upper ISM",7,0,18,18,18,18,18,18,18,18,15,15,15,15,15,15,15,15,18,18,18,18,18,18,18,18,18,18,18,18,18,18,18,18,18,18,18,18,18,18,18,18,18,18,18,18,18,18,18,18,18,18,18,18,18,18,18,18]
["Allowed Powers List","K","Upper ISM",7,13,16,19,22,25,0,0,0,0,0,0,0,0,0,0,0,0,0,0,0,0,0,0,0,0,0,0,0,0,0,0,0,0,0,0,0,0,0,0,0,0,0,0,0,0,0,0,0,0,0,0,0,0,0,0,0,0]
["Single Antenna","M","Unii 2",4,-99,-99,-99,-99,-99,-99,-99,-99,-99,-99,-99,-99,-99,-99,-99,-99,-99,-99,-99,-99,-99,-99,-99,-99,-99,-99,-99,-99,-99,-99,-99,-99,-99,-99,-99,-99,-99,-99,-99,-99,-99,-99,-99,-99,-99,-99,-99,-99,-99,-99,-99,-99,-99,-99,-99,-99,-99]
["Dual Antenna","M","Unii 2",4,-99,-99,-99,-99,-99,-99,-99,-99,-99,-99,-99,-99,-99,-99,-99,-99,-99,-99,-99,-99,-99,-99,-99,-99,-99,-99,-99,-99,-99,-99,-99,-99,-99,-99,-99,-99,-99,-99,-99,-99,-99,-99,-99,-99,-99,-99,-99,-99,-99,-99,-99,-99,-99,-99,-99,-99,-99]
["Allowed Powers List","M","Unii 2",4,-99,-99,-99,-99,-99,-99,-99,-99,-99,-99,-99,-99,-99,-99,-99,-99,-99,-99,-99,-99,-99,-99,-99,-99,-99,-99,-99,-99,-99,-99,-99,-99,-99,-99,-99,-99,-99,-99,-99,-99,-99,-99,-99,-99,-99,-99,-99,-99,-99,-99,-99,-99,-99,-99,-99,-99,-99]
["Single Antenna","M","Unii 2",7,-99,-99,-99,-99,-99,-99,-99,-99,-99,-99,-99,-99,-99,-99,-99,-99,-99,-99,-99,-99,-99,-99,-99,-99,-99,-99,-99,-99,-99,-99,-99,-99,-99,-99,-99,-99,-99,-99,-99,-99,-99,-99,-99,-99,-99,-99,-99,-99,-99,-99,-99,-99,-99,-99,-99,-99,-99]
["Dual Antenna","M","Unii 2",7,-99,-99,-99,-99,-99,-99,-99,-99,-99,-99,-99,-99,-99,-99,-99,-99,-99,-99,-99,-99,-99,-99,-99,-99,-99,-99,-99,-99,-99,-99,-99,-99,-99,-99,-99,-99,-99,-99,-99,-99,-99,-99,-99,-99,-99,-99,-99,-99,-99,-99,-99,-99,-99,-99,-99,-99,-99]
["Allowed Powers List","M","Unii 2",7,-99,-99,-99,-99,-99,-99,-99,-99,-99,-99,-99,-99,-99,-99,-99,-99,-99,-99,-99,-99,-99,-99,-99,-99,-99,-99,-99,-99,-99,-99,-99,-99,-99,-99,-99,-99,-99,-99,-99,-99,-99,-99,-99,-99,-99,-99,-99,-99,-99,-99,-99,-99,-99,-99,-99,-99,-99]
["Single Antenna","M","Unii 2ext",4,0,23,23,23,23,23,23,23,22,0,0,0,0,0,0,0,0,23,23,23,23,23,23,22,20,0,0,0,0,0,0,0,0,23,23,23,23,23,23,22,20,0,0,0,0,0,0,0,0,23,23,23,23,23,23,23,22]
["Dual Antenna","M","Unii 2ext",4,0,22,22,22,22,22,22,22,22,19,19,19,19,19,19,19,19,22,22,22,22,22,22,22,20,22,22,22,22,22,22,22,20,23,23,23,23,23,23,22,20,23,23,23,23,23,23,22,20,23,23,23,23,23,23,23,22]
["Allowed Powers List","M","Unii 2ext",4,7,11,17,20,23,0,0,0,0,0,0,0,0,0,0,0,0,0,0,0,0,0,0,0,0,0,0,0,0,0,0,0,0,0,0,0,0,0,0,0,0,0,0,0,0,0,0,0,0,0,0,0,0,0,0,0,0]
["Single Antenna","M","Unii 2ext",7,0,22,22,22,22,22,22,22,22,0,0,0,0,0,0,0,0,22,22,22,22,22,22,22,20,0,0,0,0,0,0,0,0,23,23,23,23,23,23,22,20,0,0,0,0,0,0,0,0,20,20,20,20,20,20,20,20]
["Dual Antenna","M","Unii 2ext",7,0,19,19,19,19,19,19,19,19,16,16,16,16,16,16,16,16,19,19,19,19,19,19,19,19,19,19,19,19,19,19,19,19,20,20,20,20,20,20,20,20,20,20,20,20,20,20,20,20,20,20,20,20,20,20,20,20]
["Allowed Powers List","M","Unii 2ext",7,7,11,17,20,23,0,0,0,0,0,0,0,0,0,0,0,0,0,0,0,0,0,0,0,0,0,0,0,0,0,0,0,0,0,0,0,0,0,0,0,0,0,0,0,0,0,0,0,0,0,0,0,0,0,0,0,0]
["Single Antenna","M","Upper ISM",4,0,25,25,25,25,25,24,23,22,0,0,0,0,0,0,0,0,24,24,24,24,24,23,22,20,0,0,0,0,0,0,0,0,23,23,23,23,23,23,22,20,0,0,0,0,0,0,0,0,23,23,23,23,23,23,23,22]
["Dual Antenna","M","Upper ISM",4,0,23,23,23,23,23,23,23,22,20,20,20,20,20,20,20,20,23,23,23,23,23,23,22,20,23,23,23,23,23,23,22,20,23,23,23,23,23,23,22,20,23,23,23,23,23,23,22,20,23,23,23,23,23,23,23,22]
["Allowed Powers List","M","Upper ISM",4,13,16,19,22,25,0,0,0,0,0,0,0,0,0,0,0,0,0,0,0,0,0,0,0,0,0,0,0,0,0,0,0,0,0,0,0,0,0,0,0,0,0,0,0,0,0,0,0,0,0,0,0,0,0,0,0,0]
["Single Antenna","M","Upper ISM",7,0,23,23,23,23,23,23,23,22,0,0,0,0,0,0,0,0,23,23,23,23,23,23,22,20,0,0,0,0,0,0,0,0,23,23,23,23,23,23,22,20,0,0,0,0,0,0,0,0,20,20,20,20,20,20,20,20]
["Dual Antenna","M","Upper ISM",7,0,20,20,20,20,20,20,20,20,17,17,17,17,17,17,17,17,20,20,20,20,20,20,20,20,20,20,20,20,20,20,20,20,20,20,20,20,20,20,20,20,20,20,20,20,20,20,20,20,20,20,20,20,20,20,20,20]
["Allowed Powers List","M","Upper ISM",7,13,16,19,22,25,0,0,0,0,0,0,0,0,0,0,0,0,0,0,0,0,0,0,0,0,0,0,0,0,0,0,0,0,0,0,0,0,0,0,0,0,0,0,0,0,0,0,0,0,0,0,0,0,0,0,0,0]
["Single Antenna","N","Unii 2",4,-99,-99,-99,-99,-99,-99,-99,-99,-99,-99,-99,-99,-99,-99,-99,-99,-99,-99,-99,-99,-99,-99,-99,-99,-99,-99,-99,-99,-99,-99,-99,-99,-99,-99,-99,-99,-99,-99,-99,-99,-99,-99,-99,-99,-99,-99,-99,-99,-99,-99,-99,-99,-99,-99,-99,-99,-99]
["Dual Antenna","N","Unii 2",4,-99,-99,-99,-99,-99,-99,-99,-99,-99,-99,-99,-99,-99,-99,-99,-99,-99,-99,-99,-99,-99,-99,-99,-99,-99,-99,-99,-99,-99,-99,-99,-99,-99,-99,-99,-99,-99,-99,-99,-99,-99,-99,-99,-99,-99,-99,-99,-99,-99,-99,-99,-99,-99,-99,-99,-99,-99]
["Allowed Powers List","N","Unii 2",4,-99,-99,-99,-99,-99,-99,-99,-99,-99,-99,-99,-99,-99,-99,-99,-99,-99,-99,-99,-99,-99,-99,-99,-99,-99,-99,-99,-99,-99,-99,-99,-99,-99,-99,-99,-99,-99,-99,-99,-99,-99,-99,-99,-99,-99,-99,-99,-99,-99,-99,-99,-99,-99,-99,-99,-99,-99]
["Single Antenna","N","Unii 2",7,-99,-99,-99,-99,-99,-99,-99,-99,-99,-99,-99,-99,-99,-99,-99,-99,-99,-99,-99,-99,-99,-99,-99,-99,-99,-99,-99,-99,-99,-99,-99,-99,-99,-99,-99,-99,-99,-99,-99,-99,-99,-99,-99,-99,-99,-99,-99,-99,-99,-99,-99,-99,-99,-99,-99,-99,-99]
["Dual Antenna","N","Unii 2",7,-99,-99,-99,-99,-99,-99,-99,-99,-99,-99,-99,-99,-99,-99,-99,-99,-99,-99,-99,-99,-99,-99,-99,-99,-99,-99,-99,-99,-99,-99,-99,-99,-99,-99,-99,-99,-99,-99,-99,-99,-99,-99,-99,-99,-99,-99,-99,-99,-99,-99,-99,-99,-99,-99,-99,-99,-99]
["Allowed Powers List","N","Unii 2",7,-99,-99,-99,-99,-99,-99,-99,-99,-99,-99,-99,-99,-99,-99,-99,-99,-99,-99,-99,-99,-99,-99,-99,-99,-99,-99,-99,-99,-99,-99,-99,-99,-99,-99,-99,-99,-99,-99,-99,-99,-99,-99,-99,-99,-99,-99,-99,-99,-99,-99,-99,-99,-99,-99,-99,-99,-99]
["Single Antenna","N","Unii 2ext",4,-99,-99,-99,-99,-99,-99,-99,-99,-99,-99,-99,-99,-99,-99,-99,-99,-99,-99,-99,-99,-99,-99,-99,-99,-99,-99,-99,-99,-99,-99,-99,-99,-99,-99,-99,-99,-99,-99,-99,-99,-99,-99,-99,-99,-99,-99,-99,-99,-99,-99,-99,-99,-99,-99,-99,-99,-99]
["Dual Antenna","N","Unii 2ext",4,-99,-99,-99,-99,-99,-99,-99,-99,-99,-99,-99,-99,-99,-99,-99,-99,-99,-99,-99,-99,-99,-99,-99,-99,-99,-99,-99,-99,-99,-99,-99,-99,-99,-99,-99,-99,-99,-99,-99,-99,-99,-99,-99,-99,-99,-99,-99,-99,-99,-99,-99,-99,-99,-99,-99,-99,-99]
["Allowed Powers List","N","Unii 2ext",4,-99,-99,-99,-99,-99,-99,-99,-99,-99,-99,-99,-99,-99,-99,-99,-99,-99,-99,-99,-99,-99,-99,-99,-99,-99,-99,-99,-99,-99,-99,-99,-99,-99,-99,-99,-99,-99,-99,-99,-99,-99,-99,-99,-99,-99,-99,-99,-99,-99,-99,-99,-99,-99,-99,-99,-99,-99]
["Single Antenna","N","Unii 2ext",7,-99,-99,-99,-99,-99,-99,-99,-99,-99,-99,-99,-99,-99,-99,-99,-99,-99,-99,-99,-99,-99,-99,-99,-99,-99,-99,-99,-99,-99,-99,-99,-99,-99,-99,-99,-99,-99,-99,-99,-99,-99,-99,-99,-99,-99,-99,-99,-99,-99,-99,-99,-99,-99,-99,-99,-99,-99]
["Dual Antenna","N","Unii 2ext",7,-99,-99,-99,-99,-99,-99,-99,-99,-99,-99,-99,-99,-99,-99,-99,-99,-99,-99,-99,-99,-99,-99,-99,-99,-99,-99,-99,-99,-99,-99,-99,-99,-99,-99,-99,-99,-99,-99,-99,-99,-99,-99,-99,-99,-99,-99,-99,-99,-99,-99,-99,-99,-99,-99,-99,-99,-99]
["Allowed Powers List","N","Unii 2ext",7,-99,-99,-99,-99,-99,-99,-99,-99,-99,-99,-99,-99,-99,-99,-99,-99,-99,-99,-99,-99,-99,-99,-99,-99,-99,-99,-99,-99,-99,-99,-99,-99,-99,-99,-99,-99,-99,-99,-99,-99,-99,-99,-99,-99,-99,-99,-99,-99,-99,-99,-99,-99,-99,-99,-99,-99,-99]
["Single Antenna","N","Upper ISM",4,0,25,25,25,25,25,24,23,22,0,0,0,0,0,0,0,0,24,24,24,24,24,23,22,20,0,0,0,0,0,0,0,0,24,24,24,24,24,23,22,20,0,0,0,0,0,0,0,0,25,25,25,25,25,24,23,22]
["Dual Antenna","N","Upper ISM",4,0,25,25,25,25,25,24,23,22,25,25,25,25,25,24,23,22,24,24,24,24,24,23,22,20,24,24,24,24,24,23,22,20,24,24,24,24,24,23,22,20,24,24,24,24,24,23,22,20,25,25,25,25,25,24,23,22]
["Allowed Powers List","N","Upper ISM",4,13,16,19,22,25,0,0,0,0,0,0,0,0,0,0,0,0,0,0,0,0,0,0,0,0,0,0,0,0,0,0,0,0,0,0,0,0,0,0,0,0,0,0,0,0,0,0,0,0,0,0,0,0,0,0,0,0]
["Single Antenna","N","Upper ISM",7,0,25,25,25,25,25,24,23,22,0,0,0,0,0,0,0,0,24,24,24,24,24,23,22,20,0,0,0,0,0,0,0,0,24,24,24,24,24,23,22,20,0,0,0,0,0,0,0,0,25,25,25,25,25,24,23,22]
["Dual Antenna","N","Upper ISM",7,0,25,25,25,25,25,24,23,22,23,23,23,23,23,23,23,22,24,24,24,24,24,23,22,20,24,24,24,24,24,23,22,20,24,24,24,24,24,23,22,20,24,24,24,24,24,23,22,20,25,25,25,25,25,24,23,22]
["Allowed Powers List","N","Upper ISM",7,13,16,19,22,25,0,0,0,0,0,0,0,0,0,0,0,0,0,0,0,0,0,0,0,0,0,0,0,0,0,0,0,0,0,0,0,0,0,0,0,0,0,0,0,0,0,0,0,0,0,0,0,0,0,0,0,0]
["Single Antenna","Q","Unii 2",4,-99,-99,-99,-99,-99,-99,-99,-99,-99,-99,-99,-99,-99,-99,-99,-99,-99,-99,-99,-99,-99,-99,-99,-99,-99,-99,-99,-99,-99,-99,-99,-99,-99,-99,-99,-99,-99,-99,-99,-99,-99,-99,-99,-99,-99,-99,-99,-99,-99,-99,-99,-99,-99,-99,-99,-99,-99]
["Dual Antenna","Q","Unii 2",4,-99,-99,-99,-99,-99,-99,-99,-99,-99,-99,-99,-99,-99,-99,-99,-99,-99,-99,-99,-99,-99,-99,-99,-99,-99,-99,-99,-99,-99,-99,-99,-99,-99,-99,-99,-99,-99,-99,-99,-99,-99,-99,-99,-99,-99,-99,-99,-99,-99,-99,-99,-99,-99,-99,-99,-99,-99]
["Allowed Powers List","Q","Unii 2",4,-99,-99,-99,-99,-99,-99,-99,-99,-99,-99,-99,-99,-99,-99,-99,-99,-99,-99,-99,-99,-99,-99,-99,-99,-99,-99,-99,-99,-99,-99,-99,-99,-99,-99,-99,-99,-99,-99,-99,-99,-99,-99,-99,-99,-99,-99,-99,-99,-99,-99,-99,-99,-99,-99,-99,-99,-99]
["Single Antenna","Q","Unii 2",7,-99,-99,-99,-99,-99,-99,-99,-99,-99,-99,-99,-99,-99,-99,-99,-99,-99,-99,-99,-99,-99,-99,-99,-99,-99,-99,-99,-99,-99,-99,-99,-99,-99,-99,-99,-99,-99,-99,-99,-99,-99,-99,-99,-99,-99,-99,-99,-99,-99,-99,-99,-99,-99,-99,-99,-99,-99]
["Dual Antenna","Q","Unii 2",7,-99,-99,-99,-99,-99,-99,-99,-99,-99,-99,-99,-99,-99,-99,-99,-99,-99,-99,-99,-99,-99,-99,-99,-99,-99,-99,-99,-99,-99,-99,-99,-99,-99,-99,-99,-99,-99,-99,-99,-99,-99,-99,-99,-99,-99,-99,-99,-99,-99,-99,-99,-99,-99,-99,-99,-99,-99]
["Allowed Powers List","Q","Unii 2",7,-99,-99,-99,-99,-99,-99,-99,-99,-99,-99,-99,-99,-99,-99,-99,-99,-99,-99,-99,-99,-99,-99,-99,-99,-99,-99,-99,-99,-99,-99,-99,-99,-99,-99,-99,-99,-99,-99,-99,-99,-99,-99,-99,-99,-99,-99,-99,-99,-99,-99,-99,-99,-99,-99,-99,-99,-99]
["Single Antenna","Q","Unii 2ext",4,0,22,22,22,22,22,22,22,22,0,0,0,0,0,0,0,0,22,22,22,22,22,22,22,20,0,0,0,0,0,0,0,0,22,22,22,22,22,22,22,20,0,0,0,0,0,0,0,0,22,22,22,22,22,22,22,20]
["Dual Antenna","Q","Unii 2ext",4,0,19,19,19,19,19,19,19,19,16,16,16,16,16,16,16,16,19,19,19,19,19,19,19,19,19,19,19,19,19,19,19,19,19,19,19,19,19,19,19,19,19,19,19,19,19,19,19,19,19,19,19,19,19,19,19,19]
["Allowed Powers List","Q","Unii 2ext",4,7,11,17,20,23,0,0,0,0,0,0,0,0,0,0,0,0,0,0,0,0,0,0,0,0,0,0,0,0,0,0,0,0,0,0,0,0,0,0,0,0,0,0,0,0,0,0,0,0,0,0,0,0,0,0,0,0]
["Single Antenna","Q","Unii 2ext",7,0,19,19,19,19,19,19,19,19,0,0,0,0,0,0,0,0,19,19,19,19,19,19,19,19,0,0,0,0,0,0,0,0,19,19,19,19,19,19,19,19,0,0,0,0,0,0,0,0,19,19,19,19,19,19,19,19]
["Dual Antenna","Q","Unii 2ext",7,0,16,16,16,16,16,16,16,16,13,13,13,13,13,13,13,13,16,16,16,16,16,16,16,16,16,16,16,16,16,16,16,16,16,16,16,16,16,16,16,16,16,16,16,16,16,16,16,16,16,16,16,16,16,16,16,16]
["Allowed Powers List","Q","Unii 2ext",7,7,11,17,20,23,0,0,0,0,0,0,0,0,0,0,0,0,0,0,0,0,0,0,0,0,0,0,0,0,0,0,0,0,0,0,0,0,0,0,0,0,0,0,0,0,0,0,0,0,0,0,0,0,0,0,0,0]
["Single Antenna","Q","Upper ISM",4,-99,-99,-99,-99,-99,-99,-99,-99,-99,-99,-99,-99,-99,-99,-99,-99,-99,-99,-99,-99,-99,-99,-99,-99,-99,-99,-99,-99,-99,-99,-99,-99,-99,-99,-99,-99,-99,-99,-99,-99,-99,-99,-99,-99,-99,-99,-99,-99,-99,-99,-99,-99,-99,-99,-99,-99,-99]
["Dual Antenna","Q","Upper ISM",4,-99,-99,-99,-99,-99,-99,-99,-99,-99,-99,-99,-99,-99,-99,-99,-99,-99,-99,-99,-99,-99,-99,-99,-99,-99,-99,-99,-99,-99,-99,-99,-99,-99,-99,-99,-99,-99,-99,-99,-99,-99,-99,-99,-99,-99,-99,-99,-99,-99,-99,-99,-99,-99,-99,-99,-99,-99]
["Allowed Powers List","Q","Upper ISM",4,-99,-99,-99,-99,-99,-99,-99,-99,-99,-99,-99,-99,-99,-99,-99,-99,-99,-99,-99,-99,-99,-99,-99,-99,-99,-99,-99,-99,-99,-99,-99,-99,-99,-99,-99,-99,-99,-99,-99,-99,-99,-99,-99,-99,-99,-99,-99,-99,-99,-99,-99,-99,-99,-99,-99,-99,-99]
["Single Antenna","Q","Upper ISM",7,-99,-99,-99,-99,-99,-99,-99,-99,-99,-99,-99,-99,-99,-99,-99,-99,-99,-99,-99,-99,-99,-99,-99,-99,-99,-99,-99,-99,-99,-99,-99,-99,-99,-99,-99,-99,-99,-99,-99,-99,-99,-99,-99,-99,-99,-99,-99,-99,-99,-99,-99,-99,-99,-99,-99,-99,-99]
["Dual Antenna","Q","Upper ISM",7,-99,-99,-99,-99,-99,-99,-99,-99,-99,-99,-99,-99,-99,-99,-99,-99,-99,-99,-99,-99,-99,-99,-99,-99,-99,-99,-99,-99,-99,-99,-99,-99,-99,-99,-99,-99,-99,-99,-99,-99,-99,-99,-99,-99,-99,-99,-99,-99,-99,-99,-99,-99,-99,-99,-99,-99,-99]
["Allowed Powers List","Q","Upper ISM",7,-99,-99,-99,-99,-99,-99,-99,-99,-99,-99,-99,-99,-99,-99,-99,-99,-99,-99,-99,-99,-99,-99,-99,-99,-99,-99,-99,-99,-99,-99,-99,-99,-99,-99,-99,-99,-99,-99,-99,-99,-99,-99,-99,-99,-99,-99,-99,-99,-99,-99,-99,-99,-99,-99,-99,-99,-99]
["Single Antenna","R","Unii 2",4,0,19,19,19,19,19,19,19,19,0,0,0,0,0,0,0,0,19,19,19,19,19,19,19,19,0,0,0,0,0,0,0,0,19,19,19,19,19,19,19,19,0,0,0,0,0,0,0,0,19,19,19,19,19,19,19,19]
["Dual Antenna","R","Unii 2",4,0,17,17,17,17,17,17,17,17,17,17,17,17,17,17,17,17,17,17,17,17,17,17,17,17,17,17,17,17,17,17,17,17,17,17,17,17,17,17,17,17,17,17,17,17,17,17,17,17,17,17,17,17,17,17,17,17]
["Allowed Powers List","R","Unii 2",4,7,11,17,20,23,0,0,0,0,0,0,0,0,0,0,0,0,0,0,0,0,0,0,0,0,0,0,0,0,0,0,0,0,0,0,0,0,0,0,0,0,0,0,0,0,0,0,0,0,0,0,0,0,0,0,0,0]
["Single Antenna","R","Unii 2",7,0,19,19,19,19,19,19,19,19,0,0,0,0,0,0,0,0,19,19,19,19,19,19,19,19,0,0,0,0,0,0,0,0,19,19,19,19,19,19,19,19,0,0,0,0,0,0,0,0,19,19,19,19,19,19,19,19]
["Dual Antenna","R","Unii 2",7,0,17,17,17,17,17,17,17,17,17,17,17,17,17,17,17,17,17,17,17,17,17,17,17,17,17,17,17,17,17,17,17,17,17,17,17,17,17,17,17,17,17,17,17,17,17,17,17,17,17,17,17,17,17,17,17,17]
["Allowed Powers List","R","Unii 2",7,7,11,17,20,23,0,0,0,0,0,0,0,0,0,0,0,0,0,0,0,0,0,0,0,0,0,0,0,0,0,0,0,0,0,0,0,0,0,0,0,0,0,0,0,0,0,0,0,0,0,0,0,0,0,0,0,0]
["Single Antenna","R","Unii 2ext",4,0,23,23,23,23,23,23,23,22,0,0,0,0,0,0,0,0,23,23,23,23,23,23,22,20,0,0,0,0,0,0,0,0,23,23,23,23,23,23,22,20,0,0,0,0,0,0,0,0,23,23,23,23,23,23,23,22]
["Dual Antenna","R","Unii 2ext",4,0,23,23,23,23,23,23,23,22,23,23,23,23,23,23,23,22,23,23,23,23,23,23,22,20,23,23,23,23,23,23,22,20,23,23,23,23,23,23,22,20,23,23,23,23,23,23,22,20,23,23,23,23,23,23,23,22]
["Allowed Powers List","R","Unii 2ext",4,7,11,17,20,23,0,0,0,0,0,0,0,0,0,0,0,0,0,0,0,0,0,0,0,0,0,0,0,0,0,0,0,0,0,0,0,0,0,0,0,0,0,0,0,0,0,0,0,0,0,0,0,0,0,0,0,0]
["Single Antenna","R","Unii 2ext",7,0,23,23,23,23,23,23,23,22,0,0,0,0,0,0,0,0,23,23,23,23,23,23,22,20,0,0,0,0,0,0,0,0,23,23,23,23,23,23,22,20,0,0,0,0,0,0,0,0,23,23,23,23,23,23,23,22]
["Dual Antenna","R","Unii 2ext",7,0,23,23,23,23,23,23,23,22,23,23,23,23,23,23,23,22,23,23,23,23,23,23,22,20,23,23,23,23,23,23,22,20,23,23,23,23,23,23,22,20,23,23,23,23,23,23,22,20,23,23,23,23,23,23,23,22]
["Allowed Powers List","R","Unii 2ext",7,7,11,17,20,23,0,0,0,0,0,0,0,0,0,0,0,0,0,0,0,0,0,0,0,0,0,0,0,0,0,0,0,0,0,0,0,0,0,0,0,0,0,0,0,0,0,0,0,0,0,0,0,0,0,0,0,0]
["Single Antenna","R","Upper ISM",4,0,25,25,25,25,25,24,23,22,0,0,0,0,0,0,0,0,24,24,24,24,24,23,22,20,0,0,0,0,0,0,0,0,24,24,24,24,24,23,22,20,0,0,0,0,0,0,0,0,25,25,25,25,25,24,23,22]
["Dual Antenna","R","Upper ISM",4,0,25,25,25,25,25,24,23,22,25,25,25,25,25,24,23,22,24,24,24,24,24,23,22,20,24,24,24,24,24,23,22,20,24,24,24,24,24,23,22,20,24,24,24,24,24,23,22,20,25,25,25,25,25,24,23,22]
["Allowed Powers List","R","Upper ISM",4,13,16,19,22,25,0,0,0,0,0,0,0,0,0,0,0,0,0,0,0,0,0,0,0,0,0,0,0,0,0,0,0,0,0,0,0,0,0,0,0,0,0,0,0,0,0,0,0,0,0,0,0,0,0,0,0,0]
["Single Antenna","R","Upper ISM",7,0,25,25,25,25,25,24,23,22,0,0,0,0,0,0,0,0,24,24,24,24,24,23,22,20,0,0,0,0,0,0,0,0,24,24,24,24,24,23,22,20,0,0,0,0,0,0,0,0,25,25,25,25,25,24,23,22]
["Dual Antenna","R","Upper ISM",7,0,25,25,25,25,25,24,23,22,25,25,25,25,25,24,23,22,24,24,24,24,24,23,22,20,24,24,24,24,24,23,22,20,24,24,24,24,24,23,22,20,24,24,24,24,24,23,22,20,25,25,25,25,25,24,23,22]
["Allowed Powers List","R","Upper ISM",7,13,16,19,22,25,0,0,0,0,0,0,0,0,0,0,0,0,0,0,0,0,0,0,0,0,0,0,0,0,0,0,0,0,0,0,0,0,0,0,0,0,0,0,0,0,0,0,0,0,0,0,0,0,0,0,0,0]
["Single Antenna","S","Unii 2",4,-99,-99,-99,-99,-99,-99,-99,-99,-99,-99,-99,-99,-99,-99,-99,-99,-99,-99,-99,-99,-99,-99,-99,-99,-99,-99,-99,-99,-99,-99,-99,-99,-99,-99,-99,-99,-99,-99,-99,-99,-99,-99,-99,-99,-99,-99,-99,-99,-99,-99,-99,-99,-99,-99,-99,-99,-99]
["Dual Antenna","S","Unii 2",4,-99,-99,-99,-99,-99,-99,-99,-99,-99,-99,-99,-99,-99,-99,-99,-99,-99,-99,-99,-99,-99,-99,-99,-99,-99,-99,-99,-99,-99,-99,-99,-99,-99,-99,-99,-99,-99,-99,-99,-99,-99,-99,-99,-99,-99,-99,-99,-99,-99,-99,-99,-99,-99,-99,-99,-99,-99]
["Allowed Powers List","S","Unii 2",4,-99,-99,-99,-99,-99,-99,-99,-99,-99,-99,-99,-99,-99,-99,-99,-99,-99,-99,-99,-99,-99,-99,-99,-99,-99,-99,-99,-99,-99,-99,-99,-99,-99,-99,-99,-99,-99,-99,-99,-99,-99,-99,-99,-99,-99,-99,-99,-99,-99,-99,-99,-99,-99,-99,-99,-99,-99]
["Single Antenna","S","Unii 2",7,-99,-99,-99,-99,-99,-99,-99,-99,-99,-99,-99,-99,-99,-99,-99,-99,-99,-99,-99,-99,-99,-99,-99,-99,-99,-99,-99,-99,-99,-99,-99,-99,-99,-99,-99,-99,-99,-99,-99,-99,-99,-99,-99,-99,-99,-99,-99,-99,-99,-99,-99,-99,-99,-99,-99,-99,-99]
["Dual Antenna","S","Unii 2",7,-99,-99,-99,-99,-99,-99,-99,-99,-99,-99,-99,-99,-99,-99,-99,-99,-99,-99,-99,-99,-99,-99,-99,-99,-99,-99,-99,-99,-99,-99,-99,-99,-99,-99,-99,-99,-99,-99,-99,-99,-99,-99,-99,-99,-99,-99,-99,-99,-99,-99,-99,-99,-99,-99,-99,-99,-99]
["Allowed Powers List","S","Unii 2",7,-99,-99,-99,-99,-99,-99,-99,-99,-99,-99,-99,-99,-99,-99,-99,-99,-99,-99,-99,-99,-99,-99,-99,-99,-99,-99,-99,-99,-99,-99,-99,-99,-99,-99,-99,-99,-99,-99,-99,-99,-99,-99,-99,-99,-99,-99,-99,-99,-99,-99,-99,-99,-99,-99,-99,-99,-99]
["Single Antenna","S","Unii 2ext",4,-99,-99,-99,-99,-99,-99,-99,-99,-99,-99,-99,-99,-99,-99,-99,-99,-99,-99,-99,-99,-99,-99,-99,-99,-99,-99,-99,-99,-99,-99,-99,-99,-99,-99,-99,-99,-99,-99,-99,-99,-99,-99,-99,-99,-99,-99,-99,-99,-99,-99,-99,-99,-99,-99,-99,-99,-99]
["Dual Antenna","S","Unii 2ext",4,-99,-99,-99,-99,-99,-99,-99,-99,-99,-99,-99,-99,-99,-99,-99,-99,-99,-99,-99,-99,-99,-99,-99,-99,-99,-99,-99,-99,-99,-99,-99,-99,-99,-99,-99,-99,-99,-99,-99,-99,-99,-99,-99,-99,-99,-99,-99,-99,-99,-99,-99,-99,-99,-99,-99,-99,-99]
["Allowed Powers List","S","Unii 2ext",4,-99,-99,-99,-99,-99,-99,-99,-99,-99,-99,-99,-99,-99,-99,-99,-99,-99,-99,-99,-99,-99,-99,-99,-99,-99,-99,-99,-99,-99,-99,-99,-99,-99,-99,-99,-99,-99,-99,-99,-99,-99,-99,-99,-99,-99,-99,-99,-99,-99,-99,-99,-99,-99,-99,-99,-99,-99]
["Single Antenna","S","Unii 2ext",7,-99,-99,-99,-99,-99,-99,-99,-99,-99,-99,-99,-99,-99,-99,-99,-99,-99,-99,-99,-99,-99,-99,-99,-99,-99,-99,-99,-99,-99,-99,-99,-99,-99,-99,-99,-99,-99,-99,-99,-99,-99,-99,-99,-99,-99,-99,-99,-99,-99,-99,-99,-99,-99,-99,-99,-99,-99]
["Dual Antenna","S","Unii 2ext",7,-99,-99,-99,-99,-99,-99,-99,-99,-99,-99,-99,-99,-99,-99,-99,-99,-99,-99,-99,-99,-99,-99,-99,-99,-99,-99,-99,-99,-99,-99,-99,-99,-99,-99,-99,-99,-99,-99,-99,-99,-99,-99,-99,-99,-99,-99,-99,-99,-99,-99,-99,-99,-99,-99,-99,-99,-99]
["Allowed Powers List","S","Unii 2ext",7,-99,-99,-99,-99,-99,-99,-99,-99,-99,-99,-99,-99,-99,-99,-99,-99,-99,-99,-99,-99,-99,-99,-99,-99,-99,-99,-99,-99,-99,-99,-99,-99,-99,-99,-99,-99,-99,-99,-99,-99,-99,-99,-99,-99,-99,-99,-99,-99,-99,-99,-99,-99,-99,-99,-99,-99,-99]
["Single Antenna","S","Upper ISM",4,0,25,25,25,25,25,24,23,22,0,0,0,0,0,0,0,0,24,24,24,24,24,23,22,20,0,0,0,0,0,0,0,0,24,24,24,24,24,23,22,20,0,0,0,0,0,0,0,0,25,25,25,25,24,23,22,20]
["Dual Antenna","S","Upper ISM",4,0,23,23,23,23,23,23,23,22,20,20,20,20,20,20,20,20,23,23,23,23,23,23,22,20,23,23,23,23,23,23,22,20,23,23,23,23,23,23,22,20,23,23,23,23,23,23,22,20,23,23,23,23,23,23,23,22]
["Allowed Powers List","S","Upper ISM",4,13,16,19,22,25,0,0,0,0,0,0,0,0,0,0,0,0,0,0,0,0,0,0,0,0,0,0,0,0,0,0,0,0,0,0,0,0,0,0,0,0,0,0,0,0,0,0,0,0,0,0,0,0,0,0,0,0]
["Single Antenna","S","Upper ISM",7,0,23,23,23,23,23,23,23,22,0,0,0,0,0,0,0,0,23,23,23,23,23,23,22,20,0,0,0,0,0,0,0,0,23,23,23,23,23,23,22,20,0,0,0,0,0,0,0,0,23,23,23,23,23,23,22,20]
["Dual Antenna","S","Upper ISM",7,0,20,20,20,20,20,20,20,20,17,17,17,17,17,17,17,17,20,20,20,20,20,20,20,20,20,20,20,20,20,20,20,20,20,20,20,20,20,20,20,20,20,20,20,20,20,20,20,20,20,20,20,20,20,20,20,20]
["Allowed Powers List","S","Upper ISM",7,13,16,19,22,25,0,0,0,0,0,0,0,0,0,0,0,0,0,0,0,0,0,0,0,0,0,0,0,0,0,0,0,0,0,0,0,0,0,0,0,0,0,0,0,0,0,0,0,0,0,0,0,0,0,0,0,0]
["Single Antenna","T","Unii 2",4,-99,-99,-99,-99,-99,-99,-99,-99,-99,-99,-99,-99,-99,-99,-99,-99,-99,-99,-99,-99,-99,-99,-99,-99,-99,-99,-99,-99,-99,-99,-99,-99,-99,-99,-99,-99,-99,-99,-99,-99,-99,-99,-99,-99,-99,-99,-99,-99,-99,-99,-99,-99,-99,-99,-99,-99,-99]
["Dual Antenna","T","Unii 2",4,-99,-99,-99,-99,-99,-99,-99,-99,-99,-99,-99,-99,-99,-99,-99,-99,-99,-99,-99,-99,-99,-99,-99,-99,-99,-99,-99,-99,-99,-99,-99,-99,-99,-99,-99,-99,-99,-99,-99,-99,-99,-99,-99,-99,-99,-99,-99,-99,-99,-99,-99,-99,-99,-99,-99,-99,-99]
["Allowed Powers List","T","Unii 2",4,-99,-99,-99,-99,-99,-99,-99,-99,-99,-99,-99,-99,-99,-99,-99,-99,-99,-99,-99,-99,-99,-99,-99,-99,-99,-99,-99,-99,-99,-99,-99,-99,-99,-99,-99,-99,-99,-99,-99,-99,-99,-99,-99,-99,-99,-99,-99,-99,-99,-99,-99,-99,-99,-99,-99,-99,-99]
["Single Antenna","T","Unii 2",7,-99,-99,-99,-99,-99,-99,-99,-99,-99,-99,-99,-99,-99,-99,-99,-99,-99,-99,-99,-99,-99,-99,-99,-99,-99,-99,-99,-99,-99,-99,-99,-99,-99,-99,-99,-99,-99,-99,-99,-99,-99,-99,-99,-99,-99,-99,-99,-99,-99,-99,-99,-99,-99,-99,-99,-99,-99]
["Dual Antenna","T","Unii 2",7,-99,-99,-99,-99,-99,-99,-99,-99,-99,-99,-99,-99,-99,-99,-99,-99,-99,-99,-99,-99,-99,-99,-99,-99,-99,-99,-99,-99,-99,-99,-99,-99,-99,-99,-99,-99,-99,-99,-99,-99,-99,-99,-99,-99,-99,-99,-99,-99,-99,-99,-99,-99,-99,-99,-99,-99,-99]
["Allowed Powers List","T","Unii 2",7,-99,-99,-99,-99,-99,-99,-99,-99,-99,-99,-99,-99,-99,-99,-99,-99,-99,-99,-99,-99,-99,-99,-99,-99,-99,-99,-99,-99,-99,-99,-99,-99,-99,-99,-99,-99,-99,-99,-99,-99,-99,-99,-99,-99,-99,-99,-99,-99,-99,-99,-99,-99,-99,-99,-99,-99,-99]
["Single Antenna","T","Unii 2ext",4,0,23,23,23,23,23,23,23,22,0,0,0,0,0,0,0,0,23,23,23,23,23,23,22,20,0,0,0,0,0,0,0,0,23,23,23,23,23,23,22,20,0,0,0,0,0,0,0,0,23,23,23,23,23,23,22,20]
["Dual Antenna","T","Unii 2ext",4,0,20,20,20,20,20,20,20,20,17,17,17,17,17,17,17,17,20,20,20,20,20,20,20,20,20,20,20,20,20,20,20,20,20,20,20,20,20,20,20,20,20,20,20,20,20,20,20,20,20,20,20,20,20,20,20,20]
["Allowed Powers List","T","Unii 2ext",4,7,11,17,20,23,0,0,0,0,0,0,0,0,0,0,0,0,0,0,0,0,0,0,0,0,0,0,0,0,0,0,0,0,0,0,0,0,0,0,0,0,0,0,0,0,0,0,0,0,0,0,0,0,0,0,0,0]
["Single Antenna","T","Unii 2ext",7,0,20,20,20,20,20,20,20,20,0,0,0,0,0,0,0,0,20,20,20,20,20,20,20,20,0,0,0,0,0,0,0,0,20,20,20,20,20,20,20,20,0,0,0,0,0,0,0,0,20,20,20,20,20,20,20,20]
["Dual Antenna","T","Unii 2ext",7,0,17,17,17,17,17,17,17,17,14,14,14,14,14,14,14,14,17,17,17,17,17,17,17,17,17,17,17,17,17,17,17,17,17,17,17,17,17,17,17,17,17,17,17,17,17,17,17,17,17,17,17,17,17,17,17,17]
["Allowed Powers List","T","Unii 2ext",7,7,11,17,20,23,0,0,0,0,0,0,0,0,0,0,0,0,0,0,0,0,0,0,0,0,0,0,0,0,0,0,0,0,0,0,0,0,0,0,0,0,0,0,0,0,0,0,0,0,0,0,0,0,0,0,0,0]
["Single Antenna","T","Upper ISM",4,0,25,25,25,25,25,24,23,22,0,0,0,0,0,0,0,0,24,24,24,24,24,23,22,20,0,0,0,0,0,0,0,0,24,24,24,24,24,23,22,20,0,0,0,0,0,0,0,0,25,25,25,25,25,24,23,22]
["Dual Antenna","T","Upper ISM",4,0,25,25,25,25,25,24,23,22,25,25,25,25,25,24,23,22,24,24,24,24,24,23,22,20,24,24,24,24,24,23,22,20,24,24,24,24,24,23,22,20,24,24,24,24,24,23,22,20,25,25,25,25,25,24,23,22]
["Allowed Powers List","T","Upper ISM",4,13,16,19,22,25,0,0,0,0,0,0,0,0,0,0,0,0,0,0,0,0,0,0,0,0,0,0,0,0,0,0,0,0,0,0,0,0,0,0,0,0,0,0,0,0,0,0,0,0,0,0,0,0,0,0,0,0]
["Single Antenna","T","Upper ISM",7,0,25,25,25,25,25,24,23,22,0,0,0,0,0,0,0,0,24,24,24,24,24,23,22,20,0,0,0,0,0,0,0,0,24,24,24,24,24,23,22,20,0,0,0,0,0,0,0,0,25,25,25,25,25,24,23,22]
["Dual Antenna","T","Upper ISM",7,0,25,25,25,25,25,24,23,22,23,23,23,23,23,23,23,22,24,24,24,24,24,23,22,20,24,24,24,24,24,23,22,20,24,24,24,24,24,23,22,20,24,24,24,24,24,23,22,20,25,25,25,25,25,24,23,22]
["Allowed Powers List","T","Upper ISM",7,13,16,19,22,25,0,0,0,0,0,0,0,0,0,0,0,0,0,0,0,0,0,0,0,0,0,0,0,0,0,0,0,0,0,0,0,0,0,0,0,0,0,0,0,0,0,0,0,0,0,0,0,0,0,0,0,0]

{"sheet":"1552_5G_CA_PwrTable","index":2,"n_rows":194,"n_cols":61,"rows_kept":194,"cut":false,"hidden":true,"merged":[[11,53,11,60],[11,5,11,12],[11,13,11,20],[11,21,11,28],[11,29,11,36],[11,37,11,44],[11,45,11,52]]}
["DO NOT EDIT: ","This worksheet contain data for the \"1552_5GHz_Client_Access\" worksheet."]
[]
[null,null,"SITE 1",null,null,null,null,null,null,null,null,"Allowed Powers List for 1 Tx:",{"$f":"INDEX(A12:BI194,B9,9)","v":{"$error":"#REF!"}},null,null,"Final List"]
[null,null,null,null,null,null,null,null,null,"Max Power (1 Tx) =",{"$f":"INDEX(A12:BI194,B8,E8)","v":{"$error":"#REF!"}},null,{"$f":"INDEX(A12:BI194,B9,8)","v":{"$error":"#REF!"}},null,null,"PL1 =",{"$f":"K4+3","v":{"$error":"#REF!"}}]
["Reg Domain index",{"$f":"#REF!","v":{"$error":"#REF!"}},null,null,null,null,null,null,null,"PL sequence =",{"$f":"MATCH(K4,M3:M10,-1)","v":{"$error":"#REF!"}},null,{"$f":"INDEX(A12:BI194,B9,7)","v":{"$error":"#REF!"}},null,null,"PL2 =",{"$f":"INDEX(M3:M10,K5+1)+3","v":{"$error":"#REF!"}}]
["Channel index",{"$f":"#REF!","v":{"$error":"#REF!"}},null,null,null,null,null,null,null,null,null,null,{"$f":"INDEX(A12:BI194,B9,6)","v":{"$error":"#REF!"}},null,null,"PL3 =",{"$f":"INDEX(M3:M10,K5+2)+3","v":{"$error":"#REF!"}}]
["Antenna gain index",{"$f":"#REF!","v":{"$error":"#REF!"}},null,"Rate index",{"$f":"#REF!","v":{"$error":"#REF!"}},null,null,null,null,null,null,null,{"$f":"INDEX(A12:BI194,B9,5)","v":{"$error":"#REF!"}},null,null,"PL4 =",{"$f":"INDEX(M3:M10,K5+3)+3","v":{"$error":"#REF!"}}]
["Max Pwr Row",{"$f":"-22+18*B5+6*B6+3*B7","v":{"$error":"#REF!"}},null,"Rate Column",{"$f":"13+E7","v":{"$error":"#REF!"}},null,null,null,null,null,null,null,{"$f":"INDEX(A12:BI194,B9,5)","v":{"$error":"#REF!"}},null,null,"PL5 =",{"$f":"INDEX(M3:M10,K5+4)+3","v":{"$error":"#REF!"}}]
["Allowed Pwr Row",{"$f":"B8+1","v":{"$error":"#REF!"}},null,null,null,null,null,null,null,null,null,null,{"$f":"INDEX(A12:BI194,B9,5)","v":{"$error":"#REF!"}}]
[null,null,null,null,null,null,null,null,null,null,null,null,{"$f":"INDEX(A12:BI194,B9,5)","v":{"$error":"#REF!"}}]
[]
["Rate Type",null,null,null,"CCK","OFDM",null,null,null,null,null,null,null,"LBF",null,null,null,null,null,null,null,"HT20",null,null,null,null,null,null,null,"HT20",null,null,null,null,null,null,null,"HT40",null,null,null,null,null,null,null,"HT40",null,null,null,null,null,null,null,"Non-HT40 Duplicate"]
["Rate Index",null,null,null,0,0,0,0,0,0,0,0,0,1,2,3,4,5,6,7,8,9,10,11,12,13,14,15,16,17,18,19,20,21,22,23,24,25,26,27,28,29,30,31,32,33,34,35,36,37,38,39,40,0,0,0,0,0,0,0,0]
[null,"Reg Domain","Channel","Ant Gain","ALL",6,9,12,18,24,36,48,54,6,9,12,18,24,36,48,54,"M0","M1","M2","M3","M4","M5","M6","M7","M8","M9","M10","M11","M12","M13","M14","M15","M0","M1","M2","M3","M4","M5","M6","M7","M8","M9","M10","M11","M12","M13","M14","M15",6,9,12,18,24,36,48,54]
["Single Antenna","A","Unii 2",4,-99,-99,-99,-99,-99,-99,-99,-99,-99,-99,-99,-99,-99,-99,-99,-99,-99,-99,-99,-99,-99,-99,-99,-99,-99,-99,-99,-99,-99,-99,-99,-99,-99,-99,-99,-99,-99,-99,-99,-99,-99,-99,-99,-99,-99,-99,-99,-99,-99,-99,-99,-99,-99,-99,-99,-99,-99]
["Dual Antenna","A","Unii 2",4,-99,-99,-99,-99,-99,-99,-99,-99,-99,-99,-99,-99,-99,-99,-99,-99,-99,-99,-99,-99,-99,-99,-99,-99,-99,-99,-99,-99,-99,-99,-99,-99,-99,-99,-99,-99,-99,-99,-99,-99,-99,-99,-99,-99,-99,-99,-99,-99,-99,-99,-99,-99,-99,-99,-99,-99,-99]
["Allowed Powers List","A","Unii 2",4,-99,-99,-99,-99,-99,-99,-99,-99,-99,-99,-99,-99,-99,-99,-99,-99,-99,-99,-99,-99,-99,-99,-99,-99,-99,-99,-99,-99,-99,-99,-99,-99,-99,-99,-99,-99,-99,-99,-99,-99,-99,-99,-99,-99,-99,-99,-99,-99,-99,-99,-99,-99,-99,-99,-99,-99,-99]
["Single Antenna","A","Unii 2",7,-99,-99,-99,-99,-99,-99,-99,-99,-99,-99,-99,-99,-99,-99,-99,-99,-99,-99,-99,-99,-99,-99,-99,-99,-99,-99,-99,-99,-99,-99,-99,-99,-99,-99,-99,-99,-99,-99,-99,-99,-99,-99,-99,-99,-99,-99,-99,-99,-99,-99,-99,-99,-99,-99,-99,-99,-99]
["Dual Antenna","A","Unii 2",7,-99,-99,-99,-99,-99,-99,-99,-99,-99,-99,-99,-99,-99,-99,-99,-99,-99,-99,-99,-99,-99,-99,-99,-99,-99,-99,-99,-99,-99,-99,-99,-99,-99,-99,-99,-99,-99,-99,-99,-99,-99,-99,-99,-99,-99,-99,-99,-99,-99,-99,-99,-99,-99,-99,-99,-99,-99]
["Allowed Powers List","A","Unii 2",7,-99,-99,-99,-99,-99,-99,-99,-99,-99,-99,-99,-99,-99,-99,-99,-99,-99,-99,-99,-99,-99,-99,-99,-99,-99,-99,-99,-99,-99,-99,-99,-99,-99,-99,-99,-99,-99,-99,-99,-99,-99,-99,-99,-99,-99,-99,-99,-99,-99,-99,-99,-99,-99,-99,-99,-99,-99]
["Single Antenna","A","Unii 2ext",4,-99,-99,-99,-99,-99,-99,-99,-99,-99,-99,-99,-99,-99,-99,-99,-99,-99,-99,-99,-99,-99,-99,-99,-99,-99,-99,-99,-99,-99,-99,-99,-99,-99,-99,-99,-99,-99,-99,-99,-99,-99,-99,-99,-99,-99,-99,-99,-99,-99,-99,-99,-99,-99,-99,-99,-99,-99]
["Dual Antenna","A","Unii 2ext",4,-99,-99,-99,-99,-99,-99,-99,-99,-99,-99,-99,-99,-99,-99,-99,-99,-99,-99,-99,-99,-99,-99,-99,-99,-99,-99,-99,-99,-99,-99,-99,-99,-99,-99,-99,-99,-99,-99,-99,-99,-99,-99,-99,-99,-99,-99,-99,-99,-99,-99,-99,-99,-99,-99,-99,-99,-99]
["Allowed Powers List","A","Unii 2ext",4,-99,-99,-99,-99,-99,-99,-99,-99,-99,-99,-99,-99,-99,-99,-99,-99,-99,-99,-99,-99,-99,-99,-99,-99,-99,-99,-99,-99,-99,-99,-99,-99,-99,-99,-99,-99,-99,-99,-99,-99,-99,-99,-99,-99,-99,-99,-99,-99,-99,-99,-99,-99,-99,-99,-99,-99,-99]
["Single Antenna","A","Unii 2ext",7,-99,-99,-99,-99,-99,-99,-99,-99,-99,-99,-99,-99,-99,-99,-99,-99,-99,-99,-99,-99,-99,-99,-99,-99,-99,-99,-99,-99,-99,-99,-99,-99,-99,-99,-99,-99,-99,-99,-99,-99,-99,-99,-99,-99,-99,-99,-99,-99,-99,-99,-99,-99,-99,-99,-99,-99,-99]
["Dual Antenna","A","Unii 2ext",7,-99,-99,-99,-99,-99,-99,-99,-99,-99,-99,-99,-99,-99,-99,-99,-99,-99,-99,-99,-99,-99,-99,-99,-99,-99,-99,-99,-99,-99,-99,-99,-99,-99,-99,-99,-99,-99,-99,-99,-99,-99,-99,-99,-99,-99,-99,-99,-99,-99,-99,-99,-99,-99,-99,-99,-99,-99]
["Allowed Powers List","A","Unii 2ext",7,-99,-99,-99,-99,-99,-99,-99,-99,-99,-99,-99,-99,-99,-99,-99,-99,-99,-99,-99,-99,-99,-99,-99,-99,-99,-99,-99,-99,-99,-99,-99,-99,-99,-99,-99,-99,-99,-99,-99,-99,-99,-99,-99,-99,-99,-99,-99,-99,-99,-99,-99,-99,-99,-99,-99,-99,-99]
["Single Antenna","A","Upper ISM",4,0,25,25,25,25,25,24,23,22,0,0,0,0,0,0,0,0,24,24,24,24,24,23,22,20,0,0,0,0,0,0,0,0,24,24,24,24,24,23,22,20,0,0,0,0,0,0,0,0,25,25,25,25,25,24,23,22]
["Dual Antenna","A","Upper ISM",4,0,25,25,25,25,25,24,23,22,25,25,25,25,25,24,23,22,24,24,24,24,24,23,22,20,24,24,24,24,24,23,22,20,24,24,24,24,24,23,22,20,24,24,24,24,24,23,22,20,25,25,25,25,25,24,23,22]
["Allowed Powers List","A","Upper ISM",4,13,16,19,22,25,0,0,0,0,0,0,0,0,0,0,0,0,0,0,0,0,0,0,0,0,0,0,0,0,0,0,0,0,0,0,0,0,0,0,0,0,0,0,0,0,0,0,0,0,0,0,0,0,0,0,0,0]
["Single Antenna","A","Upper ISM",7,0,25,25,25,25,25,24,23,22,0,0,0,0,0,0,0,0,24,24,24,24,24,23,22,20,0,0,0,0,0,0,0,0,24,24,24,24,24,23,22,20,0,0,0,0,0,0,0,0,25,25,25,25,25,24,23,22]
["Dual Antenna","A","Upper ISM",7,0,25,25,25,25,25,24,23,22,23,23,23,23,23,23,23,22,24,24,24,24,24,23,22,20,24,24,24,24,24,23,22,20,24,24,24,24,24,23,22,20,24,24,24,24,24,23,22,20,25,25,25,25,25,24,23,22]
["Allowed Powers List","A","Upper ISM",7,13,16,19,22,25,0,0,0,0,0,0,0,0,0,0,0,0,0,0,0,0,0,0,0,0,0,0,0,0,0,0,0,0,0,0,0,0,0,0,0,0,0,0,0,0,0,0,0,0,0,0,0,0,0,0,0,0]
["Single Antenna","C","Unii 2",4,-99,-99,-99,-99,-99,-99,-99,-99,-99,-99,-99,-99,-99,-99,-99,-99,-99,-99,-99,-99,-99,-99,-99,-99,-99,-99,-99,-99,-99,-99,-99,-99,-99,-99,-99,-99,-99,-99,-99,-99,-99,-99,-99,-99,-99,-99,-99,-99,-99,-99,-99,-99,-99,-99,-99,-99,-99]
["Dual Antenna","C","Unii 2",4,-99,-99,-99,-99,-99,-99,-99,-99,-99,-99,-99,-99,-99,-99,-99,-99,-99,-99,-99,-99,-99,-99,-99,-99,-99,-99,-99,-99,-99,-99,-99,-99,-99,-99,-99,-99,-99,-99,-99,-99,-99,-99,-99,-99,-99,-99,-99,-99,-99,-99,-99,-99,-99,-99,-99,-99,-99]
["Allowed Powers List","C","Unii 2",4,-99,-99,-99,-99,-99,-99,-99,-99,-99,-99,-99,-99,-99,-99,-99,-99,-99,-99,-99,-99,-99,-99,-99,-99,-99,-99,-99,-99,-99,-99,-99,-99,-99,-99,-99,-99,-99,-99,-99,-99,-99,-99,-99,-99,-99,-99,-99,-99,-99,-99,-99,-99,-99,-99,-99,-99,-99]
["Single Antenna","C","Unii 2",7,-99,-99,-99,-99,-99,-99,-99,-99,-99,-99,-99,-99,-99,-99,-99,-99,-99,-99,-99,-99,-99,-99,-99,-99,-99,-99,-99,-99,-99,-99,-99,-99,-99,-99,-99,-99,-99,-99,-99,-99,-99,-99,-99,-99,-99,-99,-99,-99,-99,-99,-99,-99,-99,-99,-99,-99,-99]
["Dual Antenna","C","Unii 2",7,-99,-99,-99,-99,-99,-99,-99,-99,-99,-99,-99,-99,-99,-99,-99,-99,-99,-99,-99,-99,-99,-99,-99,-99,-99,-99,-99,-99,-99,-99,-99,-99,-99,-99,-99,-99,-99,-99,-99,-99,-99,-99,-99,-99,-99,-99,-99,-99,-99,-99,-99,-99,-99,-99,-99,-99,-99]
["Allowed Powers List","C","Unii 2",7,-99,-99,-99,-99,-99,-99,-99,-99,-99,-99,-99,-99,-99,-99,-99,-99,-99,-99,-99,-99,-99,-99,-99,-99,-99,-99,-99,-99,-99,-99,-99,-99,-99,-99,-99,-99,-99,-99,-99,-99,-99,-99,-99,-99,-99,-99,-99,-99,-99,-99,-99,-99,-99,-99,-99,-99,-99]
["Single Antenna","C","Unii 2ext",4,-99,-99,-99,-99,-99,-99,-99,-99,-99,-99,-99,-99,-99,-99,-99,-99,-99,-99,-99,-99,-99,-99,-99,-99,-99,-99,-99,-99,-99,-99,-99,-99,-99,-99,-99,-99,-99,-99,-99,-99,-99,-99,-99,-99,-99,-99,-99,-99,-99,-99,-99,-99,-99,-99,-99,-99,-99]
["Dual Antenna","C","Unii 2ext",4,-99,-99,-99,-99,-99,-99,-99,-99,-99,-99,-99,-99,-99,-99,-99,-99,-99,-99,-99,-99,-99,-99,-99,-99,-99,-99,-99,-99,-99,-99,-99,-99,-99,-99,-99,-99,-99,-99,-99,-99,-99,-99,-99,-99,-99,-99,-99,-99,-99,-99,-99,-99,-99,-99,-99,-99,-99]
["Allowed Powers List","C","Unii 2ext",4,-99,-99,-99,-99,-99,-99,-99,-99,-99,-99,-99,-99,-99,-99,-99,-99,-99,-99,-99,-99,-99,-99,-99,-99,-99,-99,-99,-99,-99,-99,-99,-99,-99,-99,-99,-99,-99,-99,-99,-99,-99,-99,-99,-99,-99,-99,-99,-99,-99,-99,-99,-99,-99,-99,-99,-99,-99]
["Single Antenna","C","Unii 2ext",7,-99,-99,-99,-99,-99,-99,-99,-99,-99,-99,-99,-99,-99,-99,-99,-99,-99,-99,-99,-99,-99,-99,-99,-99,-99,-99,-99,-99,-99,-99,-99,-99,-99,-99,-99,-99,-99,-99,-99,-99,-99,-99,-99,-99,-99,-99,-99,-99,-99,-99,-99,-99,-99,-99,-99,-99,-99]
["Dual Antenna","C","Unii 2ext",7,-99,-99,-99,-99,-99,-99,-99,-99,-99,-99,-99,-99,-99,-99,-99,-99,-99,-99,-99,-99,-99,-99,-99,-99,-99,-99,-99,-99,-99,-99,-99,-99,-99,-99,-99,-99,-99,-99,-99,-99,-99,-99,-99,-99,-99,-99,-99,-99,-99,-99,-99,-99,-99,-99,-99,-99,-99]
["Allowed Powers List","C","Unii 2ext",7,-99,-99,-99,-99,-99,-99,-99,-99,-99,-99,-99,-99,-99,-99,-99,-99,-99,-99,-99,-99,-99,-99,-99,-99,-99,-99,-99,-99,-99,-99,-99,-99,-99,-99,-99,-99,-99,-99,-99,-99,-99,-99,-99,-99,-99,-99,-99,-99,-99,-99,-99,-99,-99,-99,-99,-99,-99]
["Single Antenna","C","Upper ISM",4,0,25,25,25,25,25,24,23,22,0,0,0,0,0,0,0,0,24,24,24,23,23,23,22,20,0,0,0,0,0,0,0,0,23,23,23,23,23,23,22,20,0,0,0,0,0,0,0,0,25,25,25,25,25,24,23,22]
["Dual Antenna","C","Upper ISM",4,0,23,23,23,23,23,23,23,22,20,20,20,20,20,20,20,20,23,23,23,23,23,23,22,20,23,23,23,23,23,23,22,20,23,23,23,23,23,23,22,20,23,23,23,23,23,23,22,20,23,23,23,23,23,23,23,22]
["Allowed Powers List","C","Upper ISM",4,13,16,19,22,25,0,0,0,0,0,0,0,0,0,0,0,0,0,0,0,0,0,0,0,0,0,0,0,0,0,0,0,0,0,0,0,0,0,0,0,0,0,0,0,0,0,0,0,0,0,0,0,0,0,0,0,0]
["Single Antenna","C","Upper ISM",7,0,23,23,23,23,23,23,23,22,0,0,0,0,0,0,0,0,23,23,23,23,23,23,22,20,0,0,0,0,0,0,0,0,23,23,23,23,23,23,22,20,0,0,0,0,0,0,0,0,23,23,23,23,23,23,22,20]
["Dual Antenna","C","Upper ISM",7,0,20,20,20,20,20,20,20,20,17,17,17,17,17,17,17,17,20,20,20,20,20,20,20,20,20,20,20,20,20,20,20,20,20,20,20,20,20,20,20,20,20,20,20,20,20,20,20,20,20,20,20,20,20,20,20,20]
["Allowed Powers List","C","Upper ISM",7,13,16,19,22,25,0,0,0,0,0,0,0,0,0,0,0,0,0,0,0,0,0,0,0,0,0,0,0,0,0,0,0,0,0,0,0,0,0,0,0,0,0,0,0,0,0,0,0,0,0,0,0,0,0,0,0,0]
["Single Antenna","E","Unii 2",4,-99,-99,-99,-99,-99,-99,-99,-99,-99,-99,-99,-99,-99,-99,-99,-99,-99,-99,-99,-99,-99,-99,-99,-99,-99,-99,-99,-99,-99,-99,-99,-99,-99,-99,-99,-99,-99,-99,-99,-99,-99,-99,-99,-99,-99,-99,-99,-99,-99,-99,-99,-99,-99,-99,-99,-99,-99]
["Dual Antenna","E","Unii 2",4,-99,-99,-99,-99,-99,-99,-99,-99,-99,-99,-99,-99,-99,-99,-99,-99,-99,-99,-99,-99,-99,-99,-99,-99,-99,-99,-99,-99,-99,-99,-99,-99,-99,-99,-99,-99,-99,-99,-99,-99,-99,-99,-99,-99,-99,-99,-99,-99,-99,-99,-99,-99,-99,-99,-99,-99,-99]
["Allowed Powers List","E","Unii 2",4,-99,-99,-99,-99,-99,-99,-99,-99,-99,-99,-99,-99,-99,-99,-99,-99,-99,-99,-99,-99,-99,-99,-99,-99,-99,-99,-99,-99,-99,-99,-99,-99,-99,-99,-99,-99,-99,-99,-99,-99,-99,-99,-99,-99,-99,-99,-99,-99,-99,-99,-99,-99,-99,-99,-99,-99,-99]
["Single Antenna","E","Unii 2",7,-99,-99,-99,-99,-99,-99,-99,-99,-99,-99,-99,-99,-99,-99,-99,-99,-99,-99,-99,-99,-99,-99,-99,-99,-99,-99,-99,-99,-99,-99,-99,-99,-99,-99,-99,-99,-99,-99,-99,-99,-99,-99,-99,-99,-99,-99,-99,-99,-99,-99,-99,-99,-99,-99,-99,-99,-99]
["Dual Antenna","E","Unii 2",7,-99,-99,-99,-99,-99,-99,-99,-99,-99,-99,-99,-99,-99,-99,-99,-99,-99,-99,-99,-99,-99,-99,-99,-99,-99,-99,-99,-99,-99,-99,-99,-99,-99,-99,-99,-99,-99,-99,-99,-99,-99,-99,-99,-99,-99,-99,-99,-99,-99,-99,-99,-99,-99,-99,-99,-99,-99]
["Allowed Powers List","E","Unii 2",7,-99,-99,-99,-99,-99,-99,-99,-99,-99,-99,-99,-99,-99,-99,-99,-99,-99,-99,-99,-99,-99,-99,-99,-99,-99,-99,-99,-99,-99,-99,-99,-99,-99,-99,-99,-99,-99,-99,-99,-99,-99,-99,-99,-99,-99,-99,-99,-99,-99,-99,-99,-99,-99,-99,-99,-99,-99]
["Single Antenna","E","Unii 2ext",4,0,23,23,23,23,23,23,23,22,0,0,0,0,0,0,0,0,23,23,23,23,23,23,22,20,0,0,0,0,0,0,0,0,23,23,23,23,23,23,22,20,0,0,0,0,0,0,0,0,23,23,23,23,23,23,23,22]
["Dual Antenna","E","Unii 2ext",4,0,22,22,22,22,22,22,22,22,19,19,19,19,19,19,19,19,22,22,22,22,22,22,22,20,22,22,22,22,22,22,22,20,23,23,23,23,23,23,22,20,23,23,23,23,23,23,22,20,23,23,23,23,23,23,23,22]
["Allowed Powers List","E","Unii 2ext",4,7,11,17,20,23,0,0,0,0,0,0,0,0,0,0,0,0,0,0,0,0,0,0,0,0,0,0,0,0,0,0,0,0,0,0,0,0,0,0,0,0,0,0,0,0,0,0,0,0,0,0,0,0,0,0,0,0]
["Single Antenna","E","Unii 2ext",7,0,22,22,22,22,22,22,22,22,0,0,0,0,0,0,0,0,22,22,22,22,22,22,22,20,0,0,0,0,0,0,0,0,23,23,23,23,23,23,22,20,0,0,0,0,0,0,0,0,23,23,23,23,23,23,23,22]
["Dual Antenna","E","Unii 2ext",7,0,19,19,19,19,19,19,19,19,16,16,16,16,16,16,16,16,19,19,19,19,19,19,19,19,19,19,19,19,19,19,19,19,20,20,20,20,20,20,20,20,20,20,20,20,20,20,20,20,20,20,20,20,20,20,20,20]
["Allowed Powers List","E","Unii 2ext",7,7,11,17,20,23,0,0,0,0,0,0,0,0,0,0,0,0,0,0,0,0,0,0,0,0,0,0,0,0,0,0,0,0,0,0,0,0,0,0,0,0,0,0,0,0,0,0,0,0,0,0,0,0,0,0,0,0]
["Single Antenna","E","Upper ISM",4,-99,-99,-99,-99,-99,-99,-99,-99,-99,-99,-99,-99,-99,-99,-99,-99,-99,-99,-99,-99,-99,-99,-99,-99,-99,-99,-99,-99,-99,-99,-99,-99,-99,-99,-99,-99,-99,-99,-99,-99,-99,-99,-99,-99,-99,-99,-99,-99,-99,-99,-99,-99,-99,-99,-99,-99,-99]
["Dual Antenna","E","Upper ISM",4,-99,-99,-99,-99,-99,-99,-99,-99,-99,-99,-99,-99,-99,-99,-99,-99,-99,-99,-99,-99,-99,-99,-99,-99,-99,-99,-99,-99,-99,-99,-99,-99,-99,-99,-99,-99,-99,-99,-99,-99,-99,-99,-99,-99,-99,-99,-99,-99,-99,-99,-99,-99,-99,-99,-99,-99,-99]
["Allowed Powers List","E","Upper ISM",4,-99,-99,-99,-99,-99,-99,-99,-99,-99,-99,-99,-99,-99,-99,-99,-99,-99,-99,-99,-99,-99,-99,-99,-99,-99,-99,-99,-99,-99,-99,-99,-99,-99,-99,-99,-99,-99,-99,-99,-99,-99,-99,-99,-99,-99,-99,-99,-99,-99,-99,-99,-99,-99,-99,-99,-99,-99]
["Single Antenna","E","Upper ISM",7,-99,-99,-99,-99,-99,-99,-99,-99,-99,-99,-99,-99,-99,-99,-99,-99,-99,-99,-99,-99,-99,-99,-99,-99,-99,-99,-99,-99,-99,-99,-99,-99,-99,-99,-99,-99,-99,-99,-99,-99,-99,-99,-99,-99,-99,-99,-99,-99,-99,-99,-99,-99,-99,-99,-99,-99,-99]
["Dual Antenna","E","Upper ISM",7,-99,-99,-99,-99,-99,-99,-99,-99,-99,-99,-99,-99,-99,-99,-99,-99,-99,-99,-99,-99,-99,-99,-99,-99,-99,-99,-99,-99,-99,-99,-99,-99,-99,-99,-99,-99,-99,-99,-99,-99,-99,-99,-99,-99,-99,-99,-99,-99,-99,-99,-99,-99,-99,-99,-99,-99,-99]
["Allowed Powers List","E","Upper ISM",7,-99,-99,-99,-99,-99,-99,-99,-99,-99,-99,-99,-99,-99,-99,-99,-99,-99,-99,-99,-99,-99,-99,-99,-99,-99,-99,-99,-99,-99,-99,-99,-99,-99,-99,-99,-99,-99,-99,-99,-99,-99,-99,-99,-99,-99,-99,-99,-99,-99,-99,-99,-99,-99,-99,-99,-99,-99]
["Single Antenna","K","Unii 2",4,0,22,22,22,22,22,22,22,22,0,0,0,0,0,0,0,0,22,22,22,22,22,22,22,20,0,0,0,0,0,0,0,0,22,22,22,22,22,22,22,20,0,0,0,0,0,0,0,0,22,22,22,22,22,22,22,20]
["Dual Antenna","K","Unii 2",4,0,19,19,19,19,19,19,19,19,16,16,16,16,16,16,16,16,19,19,19,19,19,19,19,19,19,19,19,19,19,19,19,19,19,19,19,19,19,19,19,19,19,19,19,19,19,19,19,19,19,19,19,19,19,19,19,19]
["Allowed Powers List","K","Unii 2",4,7,11,17,20,23,0,0,0,0,0,0,0,0,0,0,0,0,0,0,0,0,0,0,0,0,0,0,0,0,0,0,0,0,0,0,0,0,0,0,0,0,0,0,0,0,0,0,0,0,0,0,0,0,0,0,0,0]
["Single Antenna","K","Unii 2",7,0,19,19,19,19,19,19,19,19,0,0,0,0,0,0,0,0,19,19,19,19,19,19,19,19,0,0,0,0,0,0,0,0,19,19,19,19,19,19,19,19,0,0,0,0,0,0,0,0,19,19,19,19,19,19,19,19]
["Dual Antenna","K","Unii 2",7,0,16,16,16,16,16,16,16,16,13,13,13,13,13,13,13,13,16,16,16,16,16,16,16,16,16,16,16,16,16,16,16,16,16,16,16,16,16,16,16,16,16,16,16,16,16,16,16,16,16,16,16,16,16,16,16,16]
["Allowed Powers List","K","Unii 2",7,7,11,17,20,23,0,0,0,0,0,0,0,0,0,0,0,0,0,0,0,0,0,0,0,0,0,0,0,0,0,0,0,0,0,0,0,0,0,0,0,0,0,0,0,0,0,0,0,0,0,0,0,0,0,0,0,0]
["Single Antenna","K","Unii 2ext",4,0,22,22,22,22,22,22,22,22,0,0,0,0,0,0,0,0,22,22,22,22,22,22,22,20,0,0,0,0,0,0,0,0,22,22,22,22,22,22,22,20,0,0,0,0,0,0,0,0,22,22,22,22,22,22,22,20]
["Dual Antenna","K","Unii 2ext",4,0,19,19,19,19,19,19,19,19,16,16,16,16,16,16,16,16,19,19,19,19,19,19,19,19,19,19,19,19,19,19,19,19,19,19,19,19,19,19,19,19,19,19,19,19,19,19,19,19,19,19,19,19,19,19,19,19]
["Allowed Powers List","K","Unii 2ext",4,7,11,17,20,23,0,0,0,0,0,0,0,0,0,0,0,0,0,0,0,0,0,0,0,0,0,0,0,0,0,0,0,0,0,0,0,0,0,0,0,0,0,0,0,0,0,0,0,0,0,0,0,0,0,0,0,0]
["Single Antenna","K","Unii 2ext",7,0,19,19,19,19,19,19,19,19,0,0,0,0,0,0,0,0,19,19,19,19,19,19,19,19,0,0,0,0,0,0,0,0,19,19,19,19,19,19,19,19,0,0,0,0,0,0,0,0,19,19,19,19,19,19,19,19]
["Dual Antenna","K","Unii 2ext",7,0,16,16,16,16,16,16,16,16,13,13,13,13,13,13,13,13,16,16,16,16,16,16,16,16,16,16,16,16,16,16,16,16,16,16,16,16,16,16,16,16,16,16,16,16,16,16,16,16,16,16,16,16,16,16,16,16]
["Allowed Powers List","K","Unii 2ext",7,7,11,17,20,23,0,0,0,0,0,0,0,0,0,0,0,0,0,0,0,0,0,0,0,0,0,0,0,0,0,0,0,0,0,0,0,0,0,0,0,0,0,0,0,0,0,0,0,0,0,0,0,0,0,0,0,0]
["Single Antenna","K","Upper ISM",4,0,19,19,19,19,19,19,19,19,0,0,0,0,0,0,0,0,19,19,19,19,19,19,19,19,0,0,0,0,0,0,0,0,19,19,19,19,19,19,19,19,0,0,0,0,0,0,0,0,19,19,19,19,19,19,19,19]
["Dual Antenna","K","Upper ISM",4,0,19,19,19,19,19,19,19,19,18,18,18,18,18,18,18,18,19,19,19,19,19,19,19,19,19,19,19,19,19,19,19,19,19,19,19,19,19,19,19,19,19,19,19,19,19,19,19,19,19,19,19,19,19,19,19,19]
["Allowed Powers List","K","Upper ISM",4,13,16,19,22,25,0,0,0,0,0,0,0,0,0,0,0,0,0,0,0,0,0,0,0,0,0,0,0,0,0,0,0,0,0,0,0,0,0,0,0,0,0,0,0,0,0,0,0,0,0,0,0,0,0,0,0,0]
["Single Antenna","K","Upper ISM",7,0,19,19,19,19,19,19,19,19,0,0,0,0,0,0,0,0,19,19,19,19,19,19,19,19,0,0,0,0,0,0,0,0,19,19,19,19,19,19,19,19,0,0,0,0,0,0,0,0,19,19,19,19,19,19,19,19]
["Dual Antenna","K","Upper ISM",7,0,18,18,18,18,18,18,18,18,15,15,15,15,15,15,15,15,18,18,18,18,18,18,18,18,18,18,18,18,18,18,18,18,18,18,18,18,18,18,18,18,18,18,18,18,18,18,18,18,18,18,18,18,18,18,18,18]
["Allowed Powers List","K","Upper ISM",7,13,16,19,22,25,0,0,0,0,0,0,0,0,0,0,0,0,0,0,0,0,0,0,0,0,0,0,0,0,0,0,0,0,0,0,0,0,0,0,0,0,0,0,0,0,0,0,0,0,0,0,0,0,0,0,0,0]
["Single Antenna","M","Unii 2",4,-99,-99,-99,-99,-99,-99,-99,-99,-99,-99,-99,-99,-99,-99,-99,-99,-99,-99,-99,-99,-99,-99,-99,-99,-99,-99,-99,-99,-99,-99,-99,-99,-99,-99,-99,-99,-99,-99,-99,-99,-99,-99,-99,-99,-99,-99,-99,-99,-99,-99,-99,-99,-99,-99,-99,-99,-99]
["Dual Antenna","M","Unii 2",4,-99,-99,-99,-99,-99,-99,-99,-99,-99,-99,-99,-99,-99,-99,-99,-99,-99,-99,-99,-99,-99,-99,-99,-99,-99,-99,-99,-99,-99,-99,-99,-99,-99,-99,-99,-99,-99,-99,-99,-99,-99,-99,-99,-99,-99,-99,-99,-99,-99,-99,-99,-99,-99,-99,-99,-99,-99]
["Allowed Powers List","M","Unii 2",4,-99,-99,-99,-99,-99,-99,-99,-99,-99,-99,-99,-99,-99,-99,-99,-99,-99,-99,-99,-99,-99,-99,-99,-99,-99,-99,-99,-99,-99,-99,-99,-99,-99,-99,-99,-99,-99,-99,-99,-99,-99,-99,-99,-99,-99,-99,-99,-99,-99,-99,-99,-99,-99,-99,-99,-99,-99]
["Single Antenna","M","Unii 2",7,-99,-99,-99,-99,-99,-99,-99,-99,-99,-99,-99,-99,-99,-99,-99,-99,-99,-99,-99,-99,-99,-99,-99,-99,-99,-99,-99,-99,-99,-99,-99,-99,-99,-99,-99,-99,-99,-99,-99,-99,-99,-99,-99,-99,-99,-99,-99,-99,-99,-99,-99,-99,-99,-99,-99,-99,-99]
["Dual Antenna","M","Unii 2",7,-99,-99,-99,-99,-99,-99,-99,-99,-99,-99,-99,-99,-99,-99,-99,-99,-99,-99,-99,-99,-99,-99,-99,-99,-99,-99,-99,-99,-99,-99,-99,-99,-99,-99,-99,-99,-99,-99,-99,-99,-99,-99,-99,-99,-99,-99,-99,-99,-99,-99,-99,-99,-99,-99,-99,-99,-99]
["Allowed Powers List","M","Unii 2",7,-99,-99,-99,-99,-99,-99,-99,-99,-99,-99,-99,-99,-99,-99,-99,-99,-99,-99,-99,-99,-99,-99,-99,-99,-99,-99,-99,-99,-99,-99,-99,-99,-99,-99,-99,-99,-99,-99,-99,-99,-99,-99,-99,-99,-99,-99,-99,-99,-99,-99,-99,-99,-99,-99,-99,-99,-99]
["Single Antenna","M","Unii 2ext",4,0,23,23,23,23,23,23,23,22,0,0,0,0,0,0,0,0,23,23,23,23,23,23,22,20,0,0,0,0,0,0,0,0,23,23,23,23,23,23,22,20,0,0,0,0,0,0,0,0,23,23,23,23,23,23,23,22]
["Dual Antenna","M","Unii 2ext",4,0,22,22,22,22,22,22,22,22,19,19,19,19,19,19,19,19,22,22,22,22,22,22,22,20,22,22,22,22,22,22,22,20,23,23,23,23,23,23,22,20,23,23,23,23,23,23,22,20,23,23,23,23,23,23,23,22]
["Allowed Powers List","M","Unii 2ext",4,7,11,17,20,23,0,0,0,0,0,0,0,0,0,0,0,0,0,0,0,0,0,0,0,0,0,0,0,0,0,0,0,0,0,0,0,0,0,0,0,0,0,0,0,0,0,0,0,0,0,0,0,0,0,0,0,0]
["Single Antenna","M","Unii 2ext",7,0,22,22,22,22,22,22,22,22,0,0,0,0,0,0,0,0,22,22,22,22,22,22,22,20,0,0,0,0,0,0,0,0,23,23,23,23,23,23,22,20,0,0,0,0,0,0,0,0,20,20,20,20,20,20,20,20]
["Dual Antenna","M","Unii 2ext",7,0,19,19,19,19,19,19,19,19,16,16,16,16,16,16,16,16,19,19,19,19,19,19,19,19,19,19,19,19,19,19,19,19,20,20,20,20,20,20,20,20,20,20,20,20,20,20,20,20,20,20,20,20,20,20,20,20]
["Allowed Powers List","M","Unii 2ext",7,7,11,17,20,23,0,0,0,0,0,0,0,0,0,0,0,0,0,0,0,0,0,0,0,0,0,0,0,0,0,0,0,0,0,0,0,0,0,0,0,0,0,0,0,0,0,0,0,0,0,0,0,0,0,0,0,0]
["Single Antenna","M","Upper ISM",4,0,25,25,25,25,25,24,23,22,0,0,0,0,0,0,0,0,24,24,24,24,24,23,22,20,0,0,0,0,0,0,0,0,23,23,23,23,23,23,22,20,0,0,0,0,0,0,0,0,23,23,23,23,23,23,23,22]
["Dual Antenna","M","Upper ISM",4,0,23,23,23,23,23,23,23,22,20,20,20,20,20,20,20,20,23,23,23,23,23,23,22,20,23,23,23,23,23,23,22,20,23,23,23,23,23,23,22,20,23,23,23,23,23,23,22,20,23,23,23,23,23,23,23,22]
["Allowed Powers List","M","Upper ISM",4,13,16,19,22,25,0,0,0,0,0,0,0,0,0,0,0,0,0,0,0,0,0,0,0,0,0,0,0,0,0,0,0,0,0,0,0,0,0,0,0,0,0,0,0,0,0,0,0,0,0,0,0,0,0,0,0,0]
["Single Antenna","M","Upper ISM",7,0,23,23,23,23,23,23,23,22,0,0,0,0,0,0,0,0,23,23,23,23,23,23,22,20,0,0,0,0,0,0,0,0,23,23,23,23,23,23,22,20,0,0,0,0,0,0,0,0,20,20,20,20,20,20,20,20]
["Dual Antenna","M","Upper ISM",7,0,20,20,20,20,20,20,20,20,17,17,17,17,17,17,17,17,20,20,20,20,20,20,20,20,20,20,20,20,20,20,20,20,20,20,20,20,20,20,20,20,20,20,20,20,20,20,20,20,20,20,20,20,20,20,20,20]
["Allowed Powers List","M","Upper ISM",7,13,16,19,22,25,0,0,0,0,0,0,0,0,0,0,0,0,0,0,0,0,0,0,0,0,0,0,0,0,0,0,0,0,0,0,0,0,0,0,0,0,0,0,0,0,0,0,0,0,0,0,0,0,0,0,0,0]
["Single Antenna","N","Unii 2",4,-99,-99,-99,-99,-99,-99,-99,-99,-99,-99,-99,-99,-99,-99,-99,-99,-99,-99,-99,-99,-99,-99,-99,-99,-99,-99,-99,-99,-99,-99,-99,-99,-99,-99,-99,-99,-99,-99,-99,-99,-99,-99,-99,-99,-99,-99,-99,-99,-99,-99,-99,-99,-99,-99,-99,-99,-99]
["Dual Antenna","N","Unii 2",4,-99,-99,-99,-99,-99,-99,-99,-99,-99,-99,-99,-99,-99,-99,-99,-99,-99,-99,-99,-99,-99,-99,-99,-99,-99,-99,-99,-99,-99,-99,-99,-99,-99,-99,-99,-99,-99,-99,-99,-99,-99,-99,-99,-99,-99,-99,-99,-99,-99,-99,-99,-99,-99,-99,-99,-99,-99]
["Allowed Powers List","N","Unii 2",4,-99,-99,-99,-99,-99,-99,-99,-99,-99,-99,-99,-99,-99,-99,-99,-99,-99,-99,-99,-99,-99,-99,-99,-99,-99,-99,-99,-99,-99,-99,-99,-99,-99,-99,-99,-99,-99,-99,-99,-99,-99,-99,-99,-99,-99,-99,-99,-99,-99,-99,-99,-99,-99,-99,-99,-99,-99]
["Single Antenna","N","Unii 2",7,-99,-99,-99,-99,-99,-99,-99,-99,-99,-99,-99,-99,-99,-99,-99,-99,-99,-99,-99,-99,-99,-99,-99,-99,-99,-99,-99,-99,-99,-99,-99,-99,-99,-99,-99,-99,-99,-99,-99,-99,-99,-99,-99,-99,-99,-99,-99,-99,-99,-99,-99,-99,-99,-99,-99,-99,-99]
["Dual Antenna","N","Unii 2",7,-99,-99,-99,-99,-99,-99,-99,-99,-99,-99,-99,-99,-99,-99,-99,-99,-99,-99,-99,-99,-99,-99,-99,-99,-99,-99,-99,-99,-99,-99,-99,-99,-99,-99,-99,-99,-99,-99,-99,-99,-99,-99,-99,-99,-99,-99,-99,-99,-99,-99,-99,-99,-99,-99,-99,-99,-99]
["Allowed Powers List","N","Unii 2",7,-99,-99,-99,-99,-99,-99,-99,-99,-99,-99,-99,-99,-99,-99,-99,-99,-99,-99,-99,-99,-99,-99,-99,-99,-99,-99,-99,-99,-99,-99,-99,-99,-99,-99,-99,-99,-99,-99,-99,-99,-99,-99,-99,-99,-99,-99,-99,-99,-99,-99,-99,-99,-99,-99,-99,-99,-99]
["Single Antenna","N","Unii 2ext",4,-99,-99,-99,-99,-99,-99,-99,-99,-99,-99,-99,-99,-99,-99,-99,-99,-99,-99,-99,-99,-99,-99,-99,-99,-99,-99,-99,-99,-99,-99,-99,-99,-99,-99,-99,-99,-99,-99,-99,-99,-99,-99,-99,-99,-99,-99,-99,-99,-99,-99,-99,-99,-99,-99,-99,-99,-99]
["Dual Antenna","N","Unii 2ext",4,-99,-99,-99,-99,-99,-99,-99,-99,-99,-99,-99,-99,-99,-99,-99,-99,-99,-99,-99,-99,-99,-99,-99,-99,-99,-99,-99,-99,-99,-99,-99,-99,-99,-99,-99,-99,-99,-99,-99,-99,-99,-99,-99,-99,-99,-99,-99,-99,-99,-99,-99,-99,-99,-99,-99,-99,-99]
["Allowed Powers List","N","Unii 2ext",4,-99,-99,-99,-99,-99,-99,-99,-99,-99,-99,-99,-99,-99,-99,-99,-99,-99,-99,-99,-99,-99,-99,-99,-99,-99,-99,-99,-99,-99,-99,-99,-99,-99,-99,-99,-99,-99,-99,-99,-99,-99,-99,-99,-99,-99,-99,-99,-99,-99,-99,-99,-99,-99,-99,-99,-99,-99]
["Single Antenna","N","Unii 2ext",7,-99,-99,-99,-99,-99,-99,-99,-99,-99,-99,-99,-99,-99,-99,-99,-99,-99,-99,-99,-99,-99,-99,-99,-99,-99,-99,-99,-99,-99,-99,-99,-99,-99,-99,-99,-99,-99,-99,-99,-99,-99,-99,-99,-99,-99,-99,-99,-99,-99,-99,-99,-99,-99,-99,-99,-99,-99]
["Dual Antenna","N","Unii 2ext",7,-99,-99,-99,-99,-99,-99,-99,-99,-99,-99,-99,-99,-99,-99,-99,-99,-99,-99,-99,-99,-99,-99,-99,-99,-99,-99,-99,-99,-99,-99,-99,-99,-99,-99,-99,-99,-99,-99,-99,-99,-99,-99,-99,-99,-99,-99,-99,-99,-99,-99,-99,-99,-99,-99,-99,-99,-99]
["Allowed Powers List","N","Unii 2ext",7,-99,-99,-99,-99,-99,-99,-99,-99,-99,-99,-99,-99,-99,-99,-99,-99,-99,-99,-99,-99,-99,-99,-99,-99,-99,-99,-99,-99,-99,-99,-99,-99,-99,-99,-99,-99,-99,-99,-99,-99,-99,-99,-99,-99,-99,-99,-99,-99,-99,-99,-99,-99,-99,-99,-99,-99,-99]
["Single Antenna","N","Upper ISM",4,0,25,25,25,25,25,24,23,22,0,0,0,0,0,0,0,0,24,24,24,24,24,23,22,20,0,0,0,0,0,0,0,0,24,24,24,24,24,23,22,20,0,0,0,0,0,0,0,0,25,25,25,25,25,24,23,22]
["Dual Antenna","N","Upper ISM",4,0,25,25,25,25,25,24,23,22,25,25,25,25,25,24,23,22,24,24,24,24,24,23,22,20,24,24,24,24,24,23,22,20,24,24,24,24,24,23,22,20,24,24,24,24,24,23,22,20,25,25,25,25,25,24,23,22]
["Allowed Powers List","N","Upper ISM",4,13,16,19,22,25,0,0,0,0,0,0,0,0,0,0,0,0,0,0,0,0,0,0,0,0,0,0,0,0,0,0,0,0,0,0,0,0,0,0,0,0,0,0,0,0,0,0,0,0,0,0,0,0,0,0,0,0]
["Single Antenna","N","Upper ISM",7,0,25,25,25,25,25,24,23,22,0,0,0,0,0,0,0,0,24,24,24,24,24,23,22,20,0,0,0,0,0,0,0,0,24,24,24,24,24,23,22,20,0,0,0,0,0,0,0,0,25,25,25,25,25,24,23,22]
["Dual Antenna","N","Upper ISM",7,0,25,25,25,25,25,24,23,22,23,23,23,23,23,23,23,22,24,24,24,24,24,23,22,20,24,24,24,24,24,23,22,20,24,24,24,24,24,23,22,20,24,24,24,24,24,23,22,20,25,25,25,25,25,24,23,22]
["Allowed Powers List","N","Upper ISM",7,13,16,19,22,25,0,0,0,0,0,0,0,0,0,0,0,0,0,0,0,0,0,0,0,0,0,0,0,0,0,0,0,0,0,0,0,0,0,0,0,0,0,0,0,0,0,0,0,0,0,0,0,0,0,0,0,0]
["Single Antenna","Q","Unii 2",4,-99,-99,-99,-99,-99,-99,-99,-99,-99,-99,-99,-99,-99,-99,-99,-99,-99,-99,-99,-99,-99,-99,-99,-99,-99,-99,-99,-99,-99,-99,-99,-99,-99,-99,-99,-99,-99,-99,-99,-99,-99,-99,-99,-99,-99,-99,-99,-99,-99,-99,-99,-99,-99,-99,-99,-99,-99]
["Dual Antenna","Q","Unii 2",4,-99,-99,-99,-99,-99,-99,-99,-99,-99,-99,-99,-99,-99,-99,-99,-99,-99,-99,-99,-99,-99,-99,-99,-99,-99,-99,-99,-99,-99,-99,-99,-99,-99,-99,-99,-99,-99,-99,-99,-99,-99,-99,-99,-99,-99,-99,-99,-99,-99,-99,-99,-99,-99,-99,-99,-99,-99]
["Allowed Powers List","Q","Unii 2",4,-99,-99,-99,-99,-99,-99,-99,-99,-99,-99,-99,-99,-99,-99,-99,-99,-99,-99,-99,-99,-99,-99,-99,-99,-99,-99,-99,-99,-99,-99,-99,-99,-99,-99,-99,-99,-99,-99,-99,-99,-99,-99,-99,-99,-99,-99,-99,-99,-99,-99,-99,-99,-99,-99,-99,-99,-99]
["Single Antenna","Q","Unii 2",7,-99,-99,-99,-99,-99,-99,-99,-99,-99,-99,-99,-99,-99,-99,-99,-99,-99,-99,-99,-99,-99,-99,-99,-99,-99,-99,-99,-99,-99,-99,-99,-99,-99,-99,-99,-99,-99,-99,-99,-99,-99,-99,-99,-99,-99,-99,-99,-99,-99,-99,-99,-99,-99,-99,-99,-99,-99]
["Dual Antenna","Q","Unii 2",7,-99,-99,-99,-99,-99,-99,-99,-99,-99,-99,-99,-99,-99,-99,-99,-99,-99,-99,-99,-99,-99,-99,-99,-99,-99,-99,-99,-99,-99,-99,-99,-99,-99,-99,-99,-99,-99,-99,-99,-99,-99,-99,-99,-99,-99,-99,-99,-99,-99,-99,-99,-99,-99,-99,-99,-99,-99]
["Allowed Powers List","Q","Unii 2",7,-99,-99,-99,-99,-99,-99,-99,-99,-99,-99,-99,-99,-99,-99,-99,-99,-99,-99,-99,-99,-99,-99,-99,-99,-99,-99,-99,-99,-99,-99,-99,-99,-99,-99,-99,-99,-99,-99,-99,-99,-99,-99,-99,-99,-99,-99,-99,-99,-99,-99,-99,-99,-99,-99,-99,-99,-99]
["Single Antenna","Q","Unii 2ext",4,0,22,22,22,22,22,22,22,22,0,0,0,0,0,0,0,0,22,22,22,22,22,22,22,20,0,0,0,0,0,0,0,0,22,22,22,22,22,22,22,20,0,0,0,0,0,0,0,0,22,22,22,22,22,22,22,20]
["Dual Antenna","Q","Unii 2ext",4,0,19,19,19,19,19,19,19,19,16,16,16,16,16,16,16,16,19,19,19,19,19,19,19,19,19,19,19,19,19,19,19,19,19,19,19,19,19,19,19,19,19,19,19,19,19,19,19,19,19,19,19,19,19,19,19,19]
["Allowed Powers List","Q","Unii 2ext",4,7,11,17,20,23,0,0,0,0,0,0,0,0,0,0,0,0,0,0,0,0,0,0,0,0,0,0,0,0,0,0,0,0,0,0,0,0,0,0,0,0,0,0,0,0,0,0,0,0,0,0,0,0,0,0,0,0]
["Single Antenna","Q","Unii 2ext",7,0,19,19,19,19,19,19,19,19,0,0,0,0,0,0,0,0,19,19,19,19,19,19,19,19,0,0,0,0,0,0,0,0,19,19,19,19,19,19,19,19,0,0,0,0,0,0,0,0,19,19,19,19,19,19,19,19]
["Dual Antenna","Q","Unii 2ext",7,0,16,16,16,16,16,16,16,16,13,13,13,13,13,13,13,13,16,16,16,16,16,16,16,16,16,16,16,16,16,16,16,16,16,16,16,16,16,16,16,16,16,16,16,16,16,16,16,16,16,16,16,16,16,16,16,16]
["Allowed Powers List","Q","Unii 2ext",7,7,11,17,20,23,0,0,0,0,0,0,0,0,0,0,0,0,0,0,0,0,0,0,0,0,0,0,0,0,0,0,0,0,0,0,0,0,0,0,0,0,0,0,0,0,0,0,0,0,0,0,0,0,0,0,0,0]
["Single Antenna","Q","Upper ISM",4,-99,-99,-99,-99,-99,-99,-99,-99,-99,-99,-99,-99,-99,-99,-99,-99,-99,-99,-99,-99,-99,-99,-99,-99,-99,-99,-99,-99,-99,-99,-99,-99,-99,-99,-99,-99,-99,-99,-99,-99,-99,-99,-99,-99,-99,-99,-99,-99,-99,-99,-99,-99,-99,-99,-99,-99,-99]
["Dual Antenna","Q","Upper ISM",4,-99,-99,-99,-99,-99,-99,-99,-99,-99,-99,-99,-99,-99,-99,-99,-99,-99,-99,-99,-99,-99,-99,-99,-99,-99,-99,-99,-99,-99,-99,-99,-99,-99,-99,-99,-99,-99,-99,-99,-99,-99,-99,-99,-99,-99,-99,-99,-99,-99,-99,-99,-99,-99,-99,-99,-99,-99]
["Allowed Powers List","Q","Upper ISM",4,-99,-99,-99,-99,-99,-99,-99,-99,-99,-99,-99,-99,-99,-99,-99,-99,-99,-99,-99,-99,-99,-99,-99,-99,-99,-99,-99,-99,-99,-99,-99,-99,-99,-99,-99,-99,-99,-99,-99,-99,-99,-99,-99,-99,-99,-99,-99,-99,-99,-99,-99,-99,-99,-99,-99,-99,-99]
["Single Antenna","Q","Upper ISM",7,-99,-99,-99,-99,-99,-99,-99,-99,-99,-99,-99,-99,-99,-99,-99,-99,-99,-99,-99,-99,-99,-99,-99,-99,-99,-99,-99,-99,-99,-99,-99,-99,-99,-99,-99,-99,-99,-99,-99,-99,-99,-99,-99,-99,-99,-99,-99,-99,-99,-99,-99,-99,-99,-99,-99,-99,-99]
["Dual Antenna","Q","Upper ISM",7,-99,-99,-99,-99,-99,-99,-99,-99,-99,-99,-99,-99,-99,-99,-99,-99,-99,-99,-99,-99,-99,-99,-99,-99,-99,-99,-99,-99,-99,-99,-99,-99,-99,-99,-99,-99,-99,-99,-99,-99,-99,-99,-99,-99,-99,-99,-99,-99,-99,-99,-99,-99,-99,-99,-99,-99,-99]
["Allowed Powers List","Q","Upper ISM",7,-99,-99,-99,-99,-99,-99,-99,-99,-99,-99,-99,-99,-99,-99,-99,-99,-99,-99,-99,-99,-99,-99,-99,-99,-99,-99,-99,-99,-99,-99,-99,-99,-99,-99,-99,-99,-99,-99,-99,-99,-99,-99,-99,-99,-99,-99,-99,-99,-99,-99,-99,-99,-99,-99,-99,-99,-99]
["Single Antenna","R","Unii 2",4,0,19,19,19,19,19,19,19,19,0,0,0,0,0,0,0,0,19,19,19,19,19,19,19,19,0,0,0,0,0,0,0,0,19,19,19,19,19,19,19,19,0,0,0,0,0,0,0,0,19,19,19,19,19,19,19,19]
["Dual Antenna","R","Unii 2",4,0,17,17,17,17,17,17,17,17,17,17,17,17,17,17,17,17,17,17,17,17,17,17,17,17,17,17,17,17,17,17,17,17,17,17,17,17,17,17,17,17,17,17,17,17,17,17,17,17,17,17,17,17,17,17,17,17]
["Allowed Powers List","R","Unii 2",4,7,11,17,20,23,0,0,0,0,0,0,0,0,0,0,0,0,0,0,0,0,0,0,0,0,0,0,0,0,0,0,0,0,0,0,0,0,0,0,0,0,0,0,0,0,0,0,0,0,0,0,0,0,0,0,0,0]
["Single Antenna","R","Unii 2",7,0,19,19,19,19,19,19,19,19,0,0,0,0,0,0,0,0,19,19,19,19,19,19,19,19,0,0,0,0,0,0,0,0,19,19,19,19,19,19,19,19,0,0,0,0,0,0,0,0,19,19,19,19,19,19,19,19]
["Dual Antenna","R","Unii 2",7,0,17,17,17,17,17,17,17,17,17,17,17,17,17,17,17,17,17,17,17,17,17,17,17,17,17,17,17,17,17,17,17,17,17,17,17,17,17,17,17,17,17,17,17,17,17,17,17,17,17,17,17,17,17,17,17,17]
["Allowed Powers List","R","Unii 2",7,7,11,17,20,23,0,0,0,0,0,0,0,0,0,0,0,0,0,0,0,0,0,0,0,0,0,0,0,0,0,0,0,0,0,0,0,0,0,0,0,0,0,0,0,0,0,0,0,0,0,0,0,0,0,0,0,0]
["Single Antenna","R","Unii 2ext",4,0,23,23,23,23,23,23,23,22,0,0,0,0,0,0,0,0,23,23,23,23,23,23,22,20,0,0,0,0,0,0,0,0,23,23,23,23,23,23,22,20,0,0,0,0,0,0,0,0,23,23,23,23,23,23,23,22]
["Dual Antenna","R","Unii 2ext",4,0,23,23,23,23,23,23,23,22,23,23,23,23,23,23,23,22,23,23,23,23,23,23,22,20,23,23,23,23,23,23,22,20,23,23,23,23,23,23,22,20,23,23,23,23,23,23,22,20,23,23,23,23,23,23,23,22]
["Allowed Powers List","R","Unii 2ext",4,7,11,17,20,23,0,0,0,0,0,0,0,0,0,0,0,0,0,0,0,0,0,0,0,0,0,0,0,0,0,0,0,0,0,0,0,0,0,0,0,0,0,0,0,0,0,0,0,0,0,0,0,0,0,0,0,0]
["Single Antenna","R","Unii 2ext",7,0,23,23,23,23,23,23,23,22,0,0,0,0,0,0,0,0,23,23,23,23,23,23,22,20,0,0,0,0,0,0,0,0,23,23,23,23,23,23,22,20,0,0,0,0,0,0,0,0,23,23,23,23,23,23,23,22]
["Dual Antenna","R","Unii 2ext",7,0,23,23,23,23,23,23,23,22,23,23,23,23,23,23,23,22,23,23,23,23,23,23,22,20,23,23,23,23,23,23,22,20,23,23,23,23,23,23,22,20,23,23,23,23,23,23,22,20,23,23,23,23,23,23,23,22]
["Allowed Powers List","R","Unii 2ext",7,7,11,17,20,23,0,0,0,0,0,0,0,0,0,0,0,0,0,0,0,0,0,0,0,0,0,0,0,0,0,0,0,0,0,0,0,0,0,0,0,0,0,0,0,0,0,0,0,0,0,0,0,0,0,0,0,0]
["Single Antenna","R","Upper ISM",4,0,25,25,25,25,25,24,23,22,0,0,0,0,0,0,0,0,24,24,24,24,24,23,22,20,0,0,0,0,0,0,0,0,24,24,24,24,24,23,22,20,0,0,0,0,0,0,0,0,25,25,25,25,25,24,23,22]
["Dual Antenna","R","Upper ISM",4,0,25,25,25,25,25,24,23,22,25,25,25,25,25,24,23,22,24,24,24,24,24,23,22,20,24,24,24,24,24,23,22,20,24,24,24,24,24,23,22,20,24,24,24,24,24,23,22,20,25,25,25,25,25,24,23,22]
["Allowed Powers List","R","Upper ISM",4,13,16,19,22,25,0,0,0,0,0,0,0,0,0,0,0,0,0,0,0,0,0,0,0,0,0,0,0,0,0,0,0,0,0,0,0,0,0,0,0,0,0,0,0,0,0,0,0,0,0,0,0,0,0,0,0,0]
["Single Antenna","R","Upper ISM",7,0,25,25,25,25,25,24,23,22,0,0,0,0,0,0,0,0,24,24,24,24,24,23,22,20,0,0,0,0,0,0,0,0,24,24,24,24,24,23,22,20,0,0,0,0,0,0,0,0,25,25,25,25,25,24,23,22]
["Dual Antenna","R","Upper ISM",7,0,25,25,25,25,25,24,23,22,25,25,25,25,25,24,23,22,24,24,24,24,24,23,22,20,24,24,24,24,24,23,22,20,24,24,24,24,24,23,22,20,24,24,24,24,24,23,22,20,25,25,25,25,25,24,23,22]
["Allowed Powers List","R","Upper ISM",7,13,16,19,22,25,0,0,0,0,0,0,0,0,0,0,0,0,0,0,0,0,0,0,0,0,0,0,0,0,0,0,0,0,0,0,0,0,0,0,0,0,0,0,0,0,0,0,0,0,0,0,0,0,0,0,0,0]
["Single Antenna","S","Unii 2",4,-99,-99,-99,-99,-99,-99,-99,-99,-99,-99,-99,-99,-99,-99,-99,-99,-99,-99,-99,-99,-99,-99,-99,-99,-99,-99,-99,-99,-99,-99,-99,-99,-99,-99,-99,-99,-99,-99,-99,-99,-99,-99,-99,-99,-99,-99,-99,-99,-99,-99,-99,-99,-99,-99,-99,-99,-99]
["Dual Antenna","S","Unii 2",4,-99,-99,-99,-99,-99,-99,-99,-99,-99,-99,-99,-99,-99,-99,-99,-99,-99,-99,-99,-99,-99,-99,-99,-99,-99,-99,-99,-99,-99,-99,-99,-99,-99,-99,-99,-99,-99,-99,-99,-99,-99,-99,-99,-99,-99,-99,-99,-99,-99,-99,-99,-99,-99,-99,-99,-99,-99]
["Allowed Powers List","S","Unii 2",4,-99,-99,-99,-99,-99,-99,-99,-99,-99,-99,-99,-99,-99,-99,-99,-99,-99,-99,-99,-99,-99,-99,-99,-99,-99,-99,-99,-99,-99,-99,-99,-99,-99,-99,-99,-99,-99,-99,-99,-99,-99,-99,-99,-99,-99,-99,-99,-99,-99,-99,-99,-99,-99,-99,-99,-99,-99]
["Single Antenna","S","Unii 2",7,-99,-99,-99,-99,-99,-99,-99,-99,-99,-99,-99,-99,-99,-99,-99,-99,-99,-99,-99,-99,-99,-99,-99,-99,-99,-99,-99,-99,-99,-99,-99,-99,-99,-99,-99,-99,-99,-99,-99,-99,-99,-99,-99,-99,-99,-99,-99,-99,-99,-99,-99,-99,-99,-99,-99,-99,-99]
["Dual Antenna","S","Unii 2",7,-99,-99,-99,-99,-99,-99,-99,-99,-99,-99,-99,-99,-99,-99,-99,-99,-99,-99,-99,-99,-99,-99,-99,-99,-99,-99,-99,-99,-99,-99,-99,-99,-99,-99,-99,-99,-99,-99,-99,-99,-99,-99,-99,-99,-99,-99,-99,-99,-99,-99,-99,-99,-99,-99,-99,-99,-99]
["Allowed Powers List","S","Unii 2",7,-99,-99,-99,-99,-99,-99,-99,-99,-99,-99,-99,-99,-99,-99,-99,-99,-99,-99,-99,-99,-99,-99,-99,-99,-99,-99,-99,-99,-99,-99,-99,-99,-99,-99,-99,-99,-99,-99,-99,-99,-99,-99,-99,-99,-99,-99,-99,-99,-99,-99,-99,-99,-99,-99,-99,-99,-99]
["Single Antenna","S","Unii 2ext",4,-99,-99,-99,-99,-99,-99,-99,-99,-99,-99,-99,-99,-99,-99,-99,-99,-99,-99,-99,-99,-99,-99,-99,-99,-99,-99,-99,-99,-99,-99,-99,-99,-99,-99,-99,-99,-99,-99,-99,-99,-99,-99,-99,-99,-99,-99,-99,-99,-99,-99,-99,-99,-99,-99,-99,-99,-99]
["Dual Antenna","S","Unii 2ext",4,-99,-99,-99,-99,-99,-99,-99,-99,-99,-99,-99,-99,-99,-99,-99,-99,-99,-99,-99,-99,-99,-99,-99,-99,-99,-99,-99,-99,-99,-99,-99,-99,-99,-99,-99,-99,-99,-99,-99,-99,-99,-99,-99,-99,-99,-99,-99,-99,-99,-99,-99,-99,-99,-99,-99,-99,-99]
["Allowed Powers List","S","Unii 2ext",4,-99,-99,-99,-99,-99,-99,-99,-99,-99,-99,-99,-99,-99,-99,-99,-99,-99,-99,-99,-99,-99,-99,-99,-99,-99,-99,-99,-99,-99,-99,-99,-99,-99,-99,-99,-99,-99,-99,-99,-99,-99,-99,-99,-99,-99,-99,-99,-99,-99,-99,-99,-99,-99,-99,-99,-99,-99]
["Single Antenna","S","Unii 2ext",7,-99,-99,-99,-99,-99,-99,-99,-99,-99,-99,-99,-99,-99,-99,-99,-99,-99,-99,-99,-99,-99,-99,-99,-99,-99,-99,-99,-99,-99,-99,-99,-99,-99,-99,-99,-99,-99,-99,-99,-99,-99,-99,-99,-99,-99,-99,-99,-99,-99,-99,-99,-99,-99,-99,-99,-99,-99]
["Dual Antenna","S","Unii 2ext",7,-99,-99,-99,-99,-99,-99,-99,-99,-99,-99,-99,-99,-99,-99,-99,-99,-99,-99,-99,-99,-99,-99,-99,-99,-99,-99,-99,-99,-99,-99,-99,-99,-99,-99,-99,-99,-99,-99,-99,-99,-99,-99,-99,-99,-99,-99,-99,-99,-99,-99,-99,-99,-99,-99,-99,-99,-99]
["Allowed Powers List","S","Unii 2ext",7,-99,-99,-99,-99,-99,-99,-99,-99,-99,-99,-99,-99,-99,-99,-99,-99,-99,-99,-99,-99,-99,-99,-99,-99,-99,-99,-99,-99,-99,-99,-99,-99,-99,-99,-99,-99,-99,-99,-99,-99,-99,-99,-99,-99,-99,-99,-99,-99,-99,-99,-99,-99,-99,-99,-99,-99,-99]
["Single Antenna","S","Upper ISM",4,0,25,25,25,25,25,24,23,22,0,0,0,0,0,0,0,0,24,24,24,24,24,23,22,20,0,0,0,0,0,0,0,0,24,24,24,24,24,23,22,20,0,0,0,0,0,0,0,0,25,25,25,25,24,23,22,20]
["Dual Antenna","S","Upper ISM",4,0,23,23,23,23,23,23,23,22,20,20,20,20,20,20,20,20,23,23,23,23,23,23,22,20,23,23,23,23,23,23,22,20,23,23,23,23,23,23,22,20,23,23,23,23,23,23,22,20,23,23,23,23,23,23,23,22]
["Allowed Powers List","S","Upper ISM",4,13,16,19,22,25,0,0,0,0,0,0,0,0,0,0,0,0,0,0,0,0,0,0,0,0,0,0,0,0,0,0,0,0,0,0,0,0,0,0,0,0,0,0,0,0,0,0,0,0,0,0,0,0,0,0,0,0]
["Single Antenna","S","Upper ISM",7,0,23,23,23,23,23,23,23,22,0,0,0,0,0,0,0,0,23,23,23,23,23,23,22,20,0,0,0,0,0,0,0,0,23,23,23,23,23,23,22,20,0,0,0,0,0,0,0,0,23,23,23,23,23,23,22,20]
["Dual Antenna","S","Upper ISM",7,0,20,20,20,20,20,20,20,20,17,17,17,17,17,17,17,17,20,20,20,20,20,20,20,20,20,20,20,20,20,20,20,20,20,20,20,20,20,20,20,20,20,20,20,20,20,20,20,20,20,20,20,20,20,20,20,20]
["Allowed Powers List","S","Upper ISM",7,13,16,19,22,25,0,0,0,0,0,0,0,0,0,0,0,0,0,0,0,0,0,0,0,0,0,0,0,0,0,0,0,0,0,0,0,0,0,0,0,0,0,0,0,0,0,0,0,0,0,0,0,0,0,0,0,0]
["Single Antenna","T","Unii 2",4,-99,-99,-99,-99,-99,-99,-99,-99,-99,-99,-99,-99,-99,-99,-99,-99,-99,-99,-99,-99,-99,-99,-99,-99,-99,-99,-99,-99,-99,-99,-99,-99,-99,-99,-99,-99,-99,-99,-99,-99,-99,-99,-99,-99,-99,-99,-99,-99,-99,-99,-99,-99,-99,-99,-99,-99,-99]
["Dual Antenna","T","Unii 2",4,-99,-99,-99,-99,-99,-99,-99,-99,-99,-99,-99,-99,-99,-99,-99,-99,-99,-99,-99,-99,-99,-99,-99,-99,-99,-99,-99,-99,-99,-99,-99,-99,-99,-99,-99,-99,-99,-99,-99,-99,-99,-99,-99,-99,-99,-99,-99,-99,-99,-99,-99,-99,-99,-99,-99,-99,-99]
["Allowed Powers List","T","Unii 2",4,-99,-99,-99,-99,-99,-99,-99,-99,-99,-99,-99,-99,-99,-99,-99,-99,-99,-99,-99,-99,-99,-99,-99,-99,-99,-99,-99,-99,-99,-99,-99,-99,-99,-99,-99,-99,-99,-99,-99,-99,-99,-99,-99,-99,-99,-99,-99,-99,-99,-99,-99,-99,-99,-99,-99,-99,-99]
["Single Antenna","T","Unii 2",7,-99,-99,-99,-99,-99,-99,-99,-99,-99,-99,-99,-99,-99,-99,-99,-99,-99,-99,-99,-99,-99,-99,-99,-99,-99,-99,-99,-99,-99,-99,-99,-99,-99,-99,-99,-99,-99,-99,-99,-99,-99,-99,-99,-99,-99,-99,-99,-99,-99,-99,-99,-99,-99,-99,-99,-99,-99]
["Dual Antenna","T","Unii 2",7,-99,-99,-99,-99,-99,-99,-99,-99,-99,-99,-99,-99,-99,-99,-99,-99,-99,-99,-99,-99,-99,-99,-99,-99,-99,-99,-99,-99,-99,-99,-99,-99,-99,-99,-99,-99,-99,-99,-99,-99,-99,-99,-99,-99,-99,-99,-99,-99,-99,-99,-99,-99,-99,-99,-99,-99,-99]
["Allowed Powers List","T","Unii 2",7,-99,-99,-99,-99,-99,-99,-99,-99,-99,-99,-99,-99,-99,-99,-99,-99,-99,-99,-99,-99,-99,-99,-99,-99,-99,-99,-99,-99,-99,-99,-99,-99,-99,-99,-99,-99,-99,-99,-99,-99,-99,-99,-99,-99,-99,-99,-99,-99,-99,-99,-99,-99,-99,-99,-99,-99,-99]
["Single Antenna","T","Unii 2ext",4,0,23,23,23,23,23,23,23,22,0,0,0,0,0,0,0,0,23,23,23,23,23,23,22,20,0,0,0,0,0,0,0,0,23,23,23,23,23,23,22,20,0,0,0,0,0,0,0,0,23,23,23,23,23,23,22,20]
["Dual Antenna","T","Unii 2ext",4,0,20,20,20,20,20,20,20,20,17,17,17,17,17,17,17,17,20,20,20,20,20,20,20,20,20,20,20,20,20,20,20,20,20,20,20,20,20,20,20,20,20,20,20,20,20,20,20,20,20,20,20,20,20,20,20,20]
["Allowed Powers List","T","Unii 2ext",4,7,11,17,20,23,0,0,0,0,0,0,0,0,0,0,0,0,0,0,0,0,0,0,0,0,0,0,0,0,0,0,0,0,0,0,0,0,0,0,0,0,0,0,0,0,0,0,0,0,0,0,0,0,0,0,0,0]
["Single Antenna","T","Unii 2ext",7,0,20,20,20,20,20,20,20,20,0,0,0,0,0,0,0,0,20,20,20,20,20,20,20,20,0,0,0,0,0,0,0,0,20,20,20,20,20,20,20,20,0,0,0,0,0,0,0,0,20,20,20,20,20,20,20,20]
["Dual Antenna","T","Unii 2ext",7,0,17,17,17,17,17,17,17,17,14,14,14,14,14,14,14,14,17,17,17,17,17,17,17,17,17,17,17,17,17,17,17,17,17,17,17,17,17,17,17,17,17,17,17,17,17,17,17,17,17,17,17,17,17,17,17,17]
["Allowed Powers List","T","Unii 2ext",7,7,11,17,20,23,0,0,0,0,0,0,0,0,0,0,0,0,0,0,0,0,0,0,0,0,0,0,0,0,0,0,0,0,0,0,0,0,0,0,0,0,0,0,0,0,0,0,0,0,0,0,0,0,0,0,0,0]
["Single Antenna","T","Upper ISM",4,0,25,25,25,25,25,24,23,22,0,0,0,0,0,0,0,0,24,24,24,24,24,23,22,20,0,0,0,0,0,0,0,0,24,24,24,24,24,23,22,20,0,0,0,0,0,0,0,0,25,25,25,25,25,24,23,22]
["Dual Antenna","T","Upper ISM",4,0,25,25,25,25,25,24,23,22,25,25,25,25,25,24,23,22,24,24,24,24,24,23,22,20,24,24,24,24,24,23,22,20,24,24,24,24,24,23,22,20,24,24,24,24,24,23,22,20,25,25,25,25,25,24,23,22]
["Allowed Powers List","T","Upper ISM",4,13,16,19,22,25,0,0,0,0,0,0,0,0,0,0,0,0,0,0,0,0,0,0,0,0,0,0,0,0,0,0,0,0,0,0,0,0,0,0,0,0,0,0,0,0,0,0,0,0,0,0,0,0,0,0,0,0]
["Single Antenna","T","Upper ISM",7,0,25,25,25,25,25,24,23,22,0,0,0,0,0,0,0,0,24,24,24,24,24,23,22,20,0,0,0,0,0,0,0,0,24,24,24,24,24,23,22,20,0,0,0,0,0,0,0,0,25,25,25,25,25,24,23,22]
["Dual Antenna","T","Upper ISM",7,0,25,25,25,25,25,24,23,22,23,23,23,23,23,23,23,22,24,24,24,24,24,23,22,20,24,24,24,24,24,23,22,20,24,24,24,24,24,23,22,20,24,24,24,24,24,23,22,20,25,25,25,25,25,24,23,22]
["Allowed Powers List","T","Upper ISM",7,13,16,19,22,25,0,0,0,0,0,0,0,0,0,0,0,0,0,0,0,0,0,0,0,0,0,0,0,0,0,0,0,0,0,0,0,0,0,0,0,0,0,0,0,0,0,0,0,0,0,0,0,0,0,0,0,0]

{"sheet":"Cover - Guidelines","index":3,"n_rows":55,"n_cols":3,"rows_kept":55,"cut":false,"hidden":false,"merged":[[5,0,5,3],[6,0,6,3]]}
[]
[null,null,"Version 1.33"]
[null,null,"Revised May 17th 2013"]
[null,null,"Malcolm Smith (mmsmith@cisco.com)"]
[]
["AP36/26/16/3500p/15xx Indoor/outdoor Capacity/Coverage Calculator"]
["For Cisco Aironet Systems"]
[]
["Models Supported:",null,"Cisco Aironet 36xx/26xx/16xx/35xxp/15xx Series"]
[]
["What's new in v1.3.7",null,"802.11ac (3600 3rd radio), 1530"]
[null,null,"removed HD and voice/video call metrics"]
[null,null,"arbitrary mesh combinations"]
[null,null,"20Mhz 11n 5GHz, 20/40/80Mhz 11ac 5Ghz"]
[null,null,"Non-standard TXP for external PA (e.g. DAS)"]
[]
["Directions for use. ",1,"Select \"Client_Access_&_Mesh\" tab to configure 2.4GHz & 5Ghz radios of indoor (AP), outdoor (OAP) and mesh (MAP/RAP) radios (both P2MP and P2P backhaul). NOTE that there are 3 radios - a 2GHz radio that supports 20MHz (802.11n), a 5GHz radio that supports 20/40MHz (802.11n) and a 5GHz radio that supportd 20/40/80MHz (802.11n/ac). Not all radios will apply to all products as will be reflected by the inability to select things such as antenna gain, etc. IGNORE results for radios not part of the product selected."]
[]
[null,2,"Select regulatory domain for your country - FCC & ETSI has the most precise adherence - be careful to check EIRP, channels and TXP against local regulatory"]
[]
[null,3,"Select AP (site 1) and client/MAP (site 2) for each radio (see 1). Popular devices like iPhone or Android are available as well as a Generic 3x3:3 device "]
[]
[null,4,"Select minimum data rate (and channel bandwidth) @ cell-edge (e.g. MCS0-20 is MCS0 20MHz channel MCS0-40 is MCS0 in 40MHz channel and MCS0-1-80 is MCS 0 of 1st spatial-stream of 80MHz channel - 802.11ac)) - DO NOT SELECT 'Future' MCSs. For a coverage-based design (e.g. outdoor), choose the lowest MCS and for a capacity-based design (indoor) choose the highest MCS. NOTE the 'Actual' data-rate box which is the minimum of the selected, max of the AP and max of the client."]
[]
[null,5,"Select antenna used on each site for each radio (2.4 & 5GHz). If using something other than Cisco/Aironet antennas, enter the gain factor in dBi. Client devices only have integrated antennas."]
[]
[null,6,"Enter antenna heights in meters for both sides"]
[]
[null,7,"Enter the channel band (for both 2.4 and 5GHz) - note that some bands like FCC UNI-1/2 are INDOOR only (and so only INDOOR AP should be used). The tool will NOT enforce this."]
[]
[null,8,"Select transmit power levels for AP on each radio/band (2.4 & 5GHz). If external (non-Cisco) power amplifier (PA) is used then specify another TXP value in the INPUT cell provided (total conducted power for all ports) and choose that value from the TXP pull-down menu. NOTE that this is gain of the Cisco PA (if used) plus external."]
[]
[null,9,"Select cables being used on each side (for 2.4 and 5GHz antennas). If using something other than Aironet cable, select other, then enter the cable loss, \"No cable\" should be selected for clients (e.g. MacBook) except for ext cards [in which case the generic 3x3:3 should be used]"]
[]
[null,10,"Select SLA target on SLA tab - this is defined as the cell-edge Outage (% of users not-served) and the average packet-error-rate (PER) target. Enterprise/SP appropriate defaults for these parameters are 10% outage and 10% PER - for VOICE/VIDEO, 1% PER should be enabled by selecting \"QOS\" mode. \nIF 360degree cell-edge coverage is not relevant (e.g. point-to-point bridge), then 50% outage should be selected."]
[]
[null,11,"On Client_Access_&_Mesh tab, observe the COVERAGE (range in meters & area in square-foot) and INDOOR LOCATION ACCURACY (both mean/50%-ile and 90%-ile confidence). CHECK \"Actual\" values chosen by the tool - this enforces TX power, EIRP and data-rate limits.] NOTE than the coverage & hence accuracy is different for each radio/band and is limited by whichever direction is weakest (check RSSI to determine which)"]
[]
[null,12,"On CAPACITY tab, view CAPACITY distrbution (% of cell AREA that can achieve that data-rate/MCS) and total AVERAGE capacity (PHY). On the SLA tab, select the Default channel/environment (e.g. indoor cubicle) in order to have a more accurate distribution."]
[]
[]
[null,13,"For mesh (multi-hop) networks, set the # of hops between the MAP and RAP in the SLA tab, and observe the REDUCTION in capacity on the CAPACITY tab"]
[]
[]
["Read All Notes"]
[null,null,"For \"best-case competitive\" purposes (i.e. not a realistic deployment) the SLA can be set to 50% outage and 10% PER (select DATA-only mode) - this will \"look good\" compared to competition but should NOT be deployed by an Enterprise/SP in a production context"]
[]
[null,null,"REMEMBER THESE ARE THEORETICAL RESULTS BASED ON NO INTERFERENCE"]
[]
[" ",null,"This utility provides (by default) an Enterprise/SP-appropriate high-level estimation of coverage and PHY capacity (not user throughput). Results may not be highly accurate for a specific cell but in general are more accurate over a large number of cells This does not preclude the necessity for pre-deployment RF planning including a site-survey."]
[]
[" ",null,"This calculation utility has been edited to stay within limitations for under the listed regulatory domains and under TX power for the FCC & ETSI domain. There may be cases where it exceeds the limitations, hence it is the responsibility of the installing parties to verify the installation is within the laws of the location in which it is being installed."]
[null,null,"When using this utility, available power levels will change based upon the regulatory domain, the antenna (or antenna gain) selected, and the datarate selected. Verify all parameters after making any parameter changes. "]
[null,null,"The indoor radios have 2 (or 3 or 4) Tx paths and 2 (or 3 or 4) Rx paths. In this utility, Tx power is the total composite power of all Tx paths. Rx sensitivity is the composite sensitivity of all two, three or four Rx paths. This utility assumes that legacy beamforming is NOT enabled (UE is presumed to prefer 802.11n). ALL ANTENNAS MUST BE USED for proper operation, otherwise capacity is seriously compromised."]
[null,null,"Coverage is based on DATA RATE coverage and NOT beacon coverage (i.e. active survey)"]

{"sheet":"Client Access & Mesh","index":4,"n_rows":87,"n_cols":85,"rows_kept":87,"cut":false,"hidden":false,"merged":[[3,2,3,12],[3,14,3,24],[28,1,29,1],[56,2,56,4],[56,6,56,8],[56,10,56,12],[56,14,56,16],[56,18,56,20],[56,22,56,24]]}
[]
[null,null,null,null,null,null,null,null,null,null,null,null,null,null,null,null,null,null,null,null,null,null,null,null,null,null,null,null,null,null,null,null,null,null,null,null,null,null,null,null,null,null,null,null,null,null,null,null,null,null,null,null,null,null,null,null,null,null,null,null,null,null,null,null,null,null,null,null,null,null,null,null,null,null,null,null,null,null,null,null,null,null,null,null,10]
[]
[]
[]
[]
[]
[]
[null,null,null,36,"dBm",null,null,35,"dBm"]
[]
[]
[]
[]
[]
[null,null,null,"Note: When choosing antennas and power levels, EIRP cannot exceed the regulatory power limit"]
[]
[]
[]
[]
[null,null,null,6.5,"Mbps",null,null,13.5,"Mbps",null,null,0,"Mbps"]
[]
[]
[]
[null,null,null,-1,"dBi",null,null,-1,"dBi",null,null,-1,"dBi",null,null,-1,"dBi",null,null,-1,"dBi",null,null,-1,"dBi"]
[]
[null,null,null,2,"dBi",null,null,5,"dBi",null,null,5,"dBi",null,null,-1.4,"dBi",null,null,-2.9,"dBi",null,null,0,"dBi"]
[]
[]
[null,null,null,4,"(meters)",null,null,null,null,null,null,null,null,null,null,2,"(meters)"]
[]
[]
[]
[]
[]
[]
[]
[]
[]
[null,null,null,-1,"dBm",null,null,-1,"dBm",null,null,-1,"dBm",null,null,-1,"dBm",null,null,-1,"dBm",null,null,-1,"dBm"]
[]
[null,null,null,23,"dBm",null,null,16.979400086720375,"dBm",null,null,16.979400086720375,"dBm",null,null,16,"dBm",null,null,13,"dBm",null,null,0,"dBm"]
[]
[]
[]
[]
[]
[null,null,null,-1,"dB",null,null,-1,"dB",null,null,-1,"dB",null,null,-1,"dB",null,null,-1,"dB",null,null,-1,"dB"]
[null,null,null,"Note: Cable selection only used when \"Other Antenna\" is selected above"]
[]
[]
[null,null,null,0,"dB",null,null,0,"dB",null,null,0,"dB",null,null,0,"dB",null,null,0,"dB",null,null,0,"dB"]
[]
[]
[]
[null,null,null,25,"dBm",null,null,21.979400086720375,"dBm",null,null,21.979400086720375,"dBm",null,null,14.6,"dBm",null,null,10.1,"dBm",null,null,0,"dBm"]
[]
[]
[]
[]
[]
[]
[null,null,null,"Site 1 -> Site 2",null,null,null,"Site 1 -> Site 2",null,null,null,"Site 1 -> Site 2",null,null,null,"Site 2 -> Site 1",null,null,null,"Site 2 -> Site 1",null,null,null,"Site 2 -> Site 1"]
[null,"Resultant RSSI",null,-80.789700043360199,"dBm",null,null,-77.779400086720386,"dBm",null,null,928.01029995663987,"dBm",null,null,-87.789700043360199,"dBm",null,null,-81.758800173440761,"dBm",null,null,911.03089986991949,"dBm"]
[]
[]
[null,"Range",null,"Site 1 <-> Site 2",null,null,null,"Site 1 <-> Site 2",null,null,null,"Site 1 <-> Site 2",null,null,null,"Site 1 <-> Site 2",null,null,null,"Site 1 <-> Site 2",null,null,null,"Site 1 <-> Site 2"]
[null,"Indoor (drywall office)",null,30.846268368990977,"meters",null,null,12.788232717829018,"meters",null,null,5.1877175107596816E-26,"meters",null,null,2989.2011325794197,"m^2",null,null,513.77259439226452,"m^2",null,null,8.454783888145881E-51,"m^2"]
[null,"Indoor (cubes walled office)",null,37.319525418672633,"meters",null,null,14.733299075762316,"meters",null,null,2.0429266855140158E-27,"meters",null,null,4375.4436727447001,"m^2",null,null,681.94583667603536,"m^2",null,null,1.311159226759138E-53,"m^2"]
[null,"Indoor (high-ceiling / HD)",null,51.860821898248538,"meters",null,null,18.815211136889658,"meters",null,null,7.6544171229280675E-30,"meters",null,null,8449.4543358572409,"m^2",null,null,1112.1620329483942,"m^2",null,null,1.8406623241963879E-58,"m^2"]
[null,null,null,null,null,null,null,null,null,null,null,null,null,null,null,"Note: 10 sq. ft = 1 m^2"]
[]
[null,"Outdoor (LOS Fresnel free)",null,244.42243145903521,"meters",null,null,53.341922855998355,"meters",null,null,1.384118299315151E-44,"meters"]
[null,"Outdoor NLOS Suburban",null,46.922317496825649,"meters",null,null,16.929572362071017,"meters",null,null,5.5200882375270584E-24,"meters"]
[null,"Outdoor NLOS Dense Urban",null,38.502256122617901,"meters",null,null,13.73319802796029,"meters",null,null,4.4778724043623218E-24,"meters"]
[]
[null,null,null,"Note: Lowest RSSI of site1->2 & site2->1 used for RANGE and AREA estimation - see RSSI for limit"]
[]
[null,"Location accuracy*",null,"Avg",null,null,null,"Avg",null,null,null,"Avg"]
[null,"Indoor (drywall office)",null,17.539035207375701,"meters",null,null,7.1358008687412973,"meters",null,null,-0.23150000000000001,"meters"]
[null,"Indoor (cubes walled office)",null,21.2682785936973,"meters",null,null,8.2563535975466689,"meters",null,null,-0.23150000000000001,"meters"]
[null,"Indoor (high-ceiling)",null,17.546234899518932,"meters",null,null,9.790430053828004,"meters",null,null,5.3745000000000003,"meters"]
[]
[null,null,null,"90%-ile",null,null,null,"90%-ile",null,null,null,"90%-ile"]
[null,"Indoor (drywall office)",null,30.6941077696167,"meters",null,null,12.487996226115214,"meters",null,null,-0.40510000000000002,"meters"]
[null,"Indoor (cubes walled office)",null,37.220445527105753,"meters",null,null,14.449012128183568,"meters",null,null,-0.40510000000000002,"meters"]
[null,"Indoor (high-ceiling)",null,30.709525635800496,"meters",null,null,17.134388735034271,"meters",null,null,9.4050999999999991,"meters"]
[null,"* assumes even AP density with >= 4 Aps"]

{"sheet":"Capacity","index":5,"n_rows":149,"n_cols":28,"rows_kept":149,"cut":false,"hidden":false,"merged":[]}
[]
[null,null,null,null,null,"DATA"]
[]
[null,null,null,null,null,"2.4GHz/20MHz (DL)","5GHz/40MHz (DL)","5GHz/80MHz (DL)","2.4GHz/20MHz (UL)","5GHz/40MHz (UL)","5GHz/80MHz (UL)"]
[null,null,null,null,"Avg. PHY capacity (Mb/s)",{"$f":"MMULT('Raw data'!$B$151:$AE$151,W$118:W$147)/(2^'SLA QoS'!$C$3)","v":46.73536526415748},{"$f":"MMULT('Raw data'!$B$152:$AE$152,X$118:X$147)/(2^'SLA QoS'!$C$3)","v":85.99396691754535},{"$f":"MMULT('Raw data'!$B$153:$AE$153,Y$118:Y$147)/(2^'SLA QoS'!$C$3)","v":{"$error":"#DIV/0!"}},{"$f":"MMULT('Raw data'!$B$151:$AE$151,Z$118:Z$147)/(2^'SLA QoS'!$C$3)","v":25.297321869988394},{"$f":"MMULT('Raw data'!$B$152:$AE$152,AA$118:AA$147)/(2^'SLA QoS'!$C$3)","v":44.302407861599519},{"$f":"MMULT('Raw data'!$B$153:$AE$153,AB$118:AB$147)/(2^'SLA QoS'!$C$3)","v":{"$error":"#DIV/0!"}}]
[]
[]
[]
[null,null,null,null,null,"2.4GHz/20MHz (DL)","2.4GHz/20MHz (UL)","5GHz/40MHz (DL)","5GHz/40MHz (UL)","5GHz/80MHz (DL)","5GHz/80MHz (UL)"]
["Distribution of MCS/data-rate",null,null,null,{"$f":"E5","v":"Avg. PHY capacity (Mb/s)"},{"$f":"F5","v":46.73536526415748},{"$f":"I5","v":25.297321869988394},{"$f":"G5","v":85.99396691754535},{"$f":"J5","v":44.302407861599519},{"$f":"H5","v":{"$error":"#DIV/0!"}},{"$f":"K5","v":{"$error":"#DIV/0!"}}]
[null,null,null,null," "]
["MCS (20/40/80Mhz)","% area covered (DL)","MCS (20/40/80Mhz)","% area covered (UL)"]
["MCS0-1",{"$f":"W118","v":2.9742856234230952E-2},"MCS0-1",{"$f":"Z118","v":0.23166393089549053},null,null,null,null,null,null,null,null,null,null,null,null,null,"All 3SS device",null,null,null,null,"All 1SS device"]
["MCS1-1",{"$f":"W119","v":2.6087533173717561E-2},"MCS1-1",{"$f":"Z119","v":0.15999573865545968},null,null,null,null,null,null,null,null,null,null,null,null,null,"5GHz sq ft","No ATF (DL/UL)","ATF (DL/UL)","Gain",null,"5GHz sq ft","No ATF (DL/UL)","ATF (DL/UL)","Gain"]
["MCS2-1",9.7095291795910366E-2,"MCS2-1",0.18930007384099937,null,null,null,null,null,null,null,null,null,null,null,null,null,"1K",{"$f":"AVERAGE(450,450)","v":450},{"$f":"AVERAGE(450,450)","v":450},{"$f":"((T15-S15)/S15)*100","v":0},null,"1K",{"$f":"AVERAGE(135,135)","v":135},{"$f":"AVERAGE(135,135)","v":135},{"$f":"((Y15-X15)/X15)*100","v":0}]
["MCS3-1",5.3559951149395997E-2,"MCS3-1",0.15252375146999264,null,null,null,null,null,null,null,null,null,null,null,null,null,"2.5K",{"$f":"AVERAGE(265,261)","v":263},{"$f":"AVERAGE(308,283)","v":295.5},{"$f":"((T16-S16)/S16)*100","v":12.357414448669202},null,"2.5K",{"$f":"AVERAGE(127,127)","v":127},{"$f":"AVERAGE(128,128)","v":128},{"$f":"((Y16-X16)/X16)*100","v":0.78740157480314954}]
["MCS4-1",0.25898552791265206,"MCS4-1",0.10183078135470515,null,null,null,null,null,null,null,null,null,null,null,null,null,"5K",{"$f":"AVERAGE(163,137)","v":150},{"$f":"AVERAGE(216,166)","v":191},27.333333333333332,null,"5K",{"$f":"AVERAGE(85,80)","v":82.5},{"$f":"AVERAGE(97,92)","v":94.5},14.545454545454545]
["MCS5-1",0.10852021198090639,"MCS5-1",3.4777346921211254E-2,null,null,null,null,null,null,null,null,null,null,null,null,null,"10K",{"$f":"AVERAGE(115,80)","v":97.5},{"$f":"AVERAGE(157,110)","v":133.5},36.923076923076927,null,"10K",{"$f":"AVERAGE(77,44)","v":60.5},{"$f":"AVERAGE(91,54)","v":72.5},19.834710743801654]
["MCS6-1",7.9548548936245342E-2,"MCS6-1",2.6042195422805708E-2]
["MCS7-1",0.34646007881694141,"MCS7-1",0.10386618143933561]
["MCS8-1",0,"MCS8-1",0]
["MCS9-1",0,"MCS9-1",0]
["MCS0-2",0,"MCS0-2",0]
["MCS1-2",0,"MCS1-2",0]
["MCS2-2",0,"MCS2-2",0]
["MCS3-2",0,"MCS3-2",0]
["MCS4-2",0,"MCS4-2",0]
["MCS5-2",0,"MCS5-2",0]
["MCS6-2",0,"MCS6-2",0]
["MCS7-2",0,"MCS7-2",0]
["MCS8-2",0,"MCS8-2",0]
["MCS9-2",0,"MCS9-2",0]
["MCS0-3",0,"MCS0-3",0]
["MCS1-3",0,"MCS1-3",0]
["MCS2-3",0,"MCS2-3",0]
["MCS3-3",0,"MCS3-3",0]
["MCS4-3",0,"MCS4-3",0]
["MCS5-3",0,"MCS5-3",0]
["MCS6-3",0,"MCS6-3",0]
["MCS7-3",0,"MCS7-3",0]
["MCS8-3",0,"MCS8-3",0]
["MCS9-3",0,"MCS9-3",0]
["MCS0-1",{"$f":"X118","v":4.5469260794607856E-2},"MCS0-1",{"$f":"AA118","v":0.25524922678673928}]
["MCS1-1",{"$f":"X119","v":4.1875261811557464E-2},"MCS1-1",{"$f":"AA119","v":0.18509885351713573}]
["MCS2-1",0.15832960080063904,"MCS2-1",0.22247720557073353]
["MCS3-1",8.3926528507353548E-2,"MCS3-1",0.17225322351999503]
["MCS4-1",0.26182004042445289,"MCS4-1",7.419544728905747E-2]
["MCS5-1",8.2949898644351677E-2,"MCS5-1",1.9158983612640915E-2]
["MCS6-1",6.0804747347229487E-2,"MCS6-1",1.4346752685680406E-2]
["MCS7-1",0.26482466166980795,"MCS7-1",5.7220307018017648E-2]
["MCS8-1",0,"MCS8-1",0]
["MCS9-1",0,"MCS9-1",0]
["MCS0-2",0,"MCS0-2",0]
["MCS1-2",0,"MCS1-2",0]
["MCS2-2",0,"MCS2-2",0]
["MCS3-2",0,"MCS3-2",0]
["MCS4-2",0,"MCS4-2",0]
["MCS5-2",0,"MCS5-2",0]
["MCS6-2",0,"MCS6-2",0]
["MCS7-2",0,"MCS7-2",0]
["MCS8-2",0,"MCS8-2",0]
["MCS9-2",0,"MCS9-2",0]
["MCS0-3",0,"MCS0-3",0]
["MCS1-3",0,"MCS1-3",0]
["MCS2-3",0,"MCS2-3",0]
["MCS3-3",0,"MCS3-3",0]
["MCS4-3",0,"MCS4-3",0]
["MCS5-3",0,"MCS5-3",0]
["MCS6-3",0,"MCS6-3",0]
["MCS7-3",0,"MCS7-3",0]
["MCS8-3",0,"MCS8-3",0]
["MCS9-3",0,"MCS9-3",0]
["MCS0-1",{"$f":"Y118","v":{"$error":"#DIV/0!"}},"MCS0-1",{"$f":"AB118","v":{"$error":"#DIV/0!"}}]
["MCS1-1",{"$f":"Y119","v":{"$error":"#DIV/0!"}},"MCS1-1",{"$f":"AB119","v":{"$error":"#DIV/0!"}}]
["MCS2-1",{"$error":"#DIV/0!"},"MCS2-1",{"$error":"#DIV/0!"}]
["MCS3-1",{"$error":"#DIV/0!"},"MCS3-1",{"$error":"#DIV/0!"}]
["MCS4-1",{"$error":"#DIV/0!"},"MCS4-1",{"$error":"#DIV/0!"}]
["MCS5-1",{"$error":"#DIV/0!"},"MCS5-1",{"$error":"#DIV/0!"}]
["MCS6-1",{"$error":"#DIV/0!"},"MCS6-1",{"$error":"#DIV/0!"}]
["MCS7-1",{"$error":"#DIV/0!"},"MCS7-1",{"$error":"#DIV/0!"}]
["MCS8-1",{"$error":"#DIV/0!"},"MCS8-1",{"$error":"#DIV/0!"}]
["MCS9-1",{"$error":"#DIV/0!"},"MCS9-1",{"$error":"#DIV/0!"}]
["MCS0-2",{"$error":"#DIV/0!"},"MCS0-2",{"$error":"#DIV/0!"}]
["MCS1-2",{"$error":"#DIV/0!"},"MCS1-2",{"$error":"#DIV/0!"}]
["MCS2-2",{"$error":"#DIV/0!"},"MCS2-2",{"$error":"#DIV/0!"}]
["MCS3-2",{"$error":"#DIV/0!"},"MCS3-2",{"$error":"#DIV/0!"}]
["MCS4-2",{"$error":"#DIV/0!"},"MCS4-2",{"$error":"#DIV/0!"}]
["MCS5-2",{"$error":"#DIV/0!"},"MCS5-2",{"$error":"#DIV/0!"}]
["MCS6-2",{"$error":"#DIV/0!"},"MCS6-2",{"$error":"#DIV/0!"}]
["MCS7-2",{"$error":"#DIV/0!"},"MCS7-2",{"$error":"#DIV/0!"}]
["MCS8-2",{"$error":"#DIV/0!"},"MCS8-2",{"$error":"#DIV/0!"}]
["MCS9-2",{"$error":"#DIV/0!"},"MCS9-2",{"$error":"#DIV/0!"}]
["MCS0-3",{"$error":"#DIV/0!"},"MCS0-3",{"$error":"#DIV/0!"}]
["MCS1-3",{"$error":"#DIV/0!"},"MCS1-3",{"$error":"#DIV/0!"}]
["MCS2-3",{"$error":"#DIV/0!"},"MCS2-3",{"$error":"#DIV/0!"}]
["MCS3-3",{"$error":"#DIV/0!"},"MCS3-3",{"$error":"#DIV/0!"}]
["MCS4-3",{"$error":"#DIV/0!"},"MCS4-3",{"$error":"#DIV/0!"}]
["MCS5-3",{"$error":"#DIV/0!"},"MCS5-3",{"$error":"#DIV/0!"}]
["MCS6-3",{"$error":"#DIV/0!"},"MCS6-3",{"$error":"#DIV/0!"}]
["MCS7-3",{"$error":"#DIV/0!"},"MCS7-3",{"$error":"#DIV/0!"}]
["MCS8-3",{"$error":"#DIV/0!"},"MCS8-3",{"$error":"#DIV/0!"}]
["MCS9-3",{"$error":"#DIV/0!"},"MCS9-3",{"$error":"#DIV/0!"}]
[]
[]
[]
[null,"2.4GHz/20Mhz (DL/UL)","5GHz/40Mhz (DL/UL)","5GHz/80Mhz (DL/UL)","2.4GHz/20MHz (DL)","5GHz/40MHz (DL)","5GHz/80MHz (DL)","2.4GHz/20MHz (UL)","5GHz/40MHz (UL)","5GHz/80MHz (UL)","2.4GHz/20MHz (DL)","5GHz/40MHz (DL)","5GHz/80MHz (DL)","2.4GHz/20MHz (UL)","5GHz/40MHz (UL)","5GHz/80MHz (UL)","2.4GHz/20MHz (DL)","5GHz/40MHz (DL)","5GHz/80MHz (DL)","2.4GHz/20MHz (UL)","5GHz/40MHz (UL)","5GHz/80MHz (UL)","2.4GHz/20MHz (DL)","5GHz/40MHz (DL)","5GHz/80MHz (DL)","2.4GHz/20MHz (UL)","5GHz/40MHz (UL)","5GHz/80MHz (UL)"]
["Max MCS (base 10)",null,null,null,{"$f":"'Client_Access_&_Mesh'!L97","v":8},{"$f":"'Client_Access_&_Mesh'!M97","v":8},{"$f":"'Client_Access_&_Mesh'!N97","v":0},{"$f":"E107","v":8},{"$f":"F107","v":8},{"$f":"G107","v":0}]
["MCS Base",null,null,null,{"$f":"'Client_Access_&_Mesh'!L94","v":8},{"$f":"'Client_Access_&_Mesh'!M94","v":8},{"$f":"'Client_Access_&_Mesh'!N94","v":0},{"$f":"E108","v":8},{"$f":"F108","v":8},0]
["Edge MCS (base 10)",null,null,null,{"$f":"'Client_Access_&_Mesh'!L101","v":1},{"$f":"'Client_Access_&_Mesh'!M101","v":1},{"$f":"'Client_Access_&_Mesh'!N101","v":0},{"$f":"E109","v":1},1,0]
["Edge SINR",null,null,null,{"$f":"'Client_Access_&_Mesh'!C136","v":10.199999999999999},{"$f":"'Client_Access_&_Mesh'!E136","v":10.199999999999999},{"$f":"'Client_Access_&_Mesh'!G136","v":1000},{"$f":"'Client_Access_&_Mesh'!D136","v":0.49037999999999998},{"$f":"'Client_Access_&_Mesh'!F136","v":0.49037999999999998},{"$f":"'Client_Access_&_Mesh'!H136","v":1000}]
["PLE",null,null,null,{"$f":"'SLA QoS'!$J$44","v":3.8},{"$f":"'SLA QoS'!$J$44","v":3.8},{"$f":"'SLA QoS'!$J$44","v":3.8},{"$f":"'SLA QoS'!$J$44","v":3.8},{"$f":"'SLA QoS'!$J$44","v":3.8},{"$f":"'SLA QoS'!$J$44","v":3.8}]
["SINR Idx",null,null,null,{"$f":"'Client_Access_&_Mesh'!C135","v":14},{"$f":"'Client_Access_&_Mesh'!E135","v":14},{"$f":"'Client_Access_&_Mesh'!G135","v":0},{"$f":"'Client_Access_&_Mesh'!D135","v":18},{"$f":"'Client_Access_&_Mesh'!F135","v":18},{"$f":"'Client_Access_&_Mesh'!H135","v":0}]
[]
["ATF correction",{"$f":"'SLA QoS'!L40","v":1}]
[]
[]
["MCS","ATF TXOP correction","ATF TXOP correction","ATF TXOP correction","SINR delta","SINR delta","SINR delta","SINR delta","SINR delta","SINR delta","% of area","% of area","% of area","% of area","% of area","% of area","Delta % area","Delta % area","Delta % area","Delta % area","Delta % area","Delta % area"," % unique area"," % unique area"," % unique area"," % unique area"," % unique area"," % unique area"]
[0,{"$f":"IF($B$114,'Raw data'!$D55,1)","v":0.94153846153846155},{"$f":"IF($B$114,'Raw data'!$D85,1)","v":0.90666666666666662},{"$f":"IF($B$114,'Raw data'!$D115,1)","v":0.96081911262798636},{"$f":"IF(AND($A118<E$107,OR(E$108=10,$A118<>8,$A118<>9)), INDEX('Raw data'!$B$155:$AE$182,E$112,$A118+1)-E$110, -1000)","v":0},{"$f":"IF(AND($A118<F$107,OR(F$108=10,$A118<>8,$A118<>9)), INDEX('Raw data'!$B$155:$AE$182,F$112,$A118+1)-F$110, -1000)","v":0},{"$f":"IF(AND($A118<G$107,OR(G$108=10,$A118<>8,$A118<>9)), INDEX('Raw data'!$B$155:$AE$182,G$112,$A118+1)-G$110, -1000)","v":-1000},{"$f":"IF(AND($A118<H$107,OR(H$108=10,$A118<>8,$A118<>9)), INDEX('Raw data'!$B$155:$AE$182,H$112,$A118+1)-H$110, -1000)","v":0},{"$f":"IF(AND($A118<I$107,OR(I$108=10,$A118<>8,$A118<>9)), INDEX('Raw data'!$B$155:$AE$182,I$112,$A118+1)-I$110, -1000)","v":0},{"$f":"IF(AND($A118<J$107,OR(J$108=10,$A118<>8,$A118<>9)), INDEX('Raw data'!$B$155:$AE$182,J$112,$A118+1)-J$110, -1000)","v":-1000},{"$f":"IF(E118>=0,(10^(-E118/(10*E$111)))^2,0)","v":1},1,0,1,1,0,{"$f":"IF(K118<>0, (K118-K119)*B118, 0)","v":2.6103406070150052E-2},{"$f":"IF(L118<>0, (L118-L119)*C118, 0)","v":2.5136613252737083E-2},0,{"$f":"IF(N118<>0, (N118-N119)*B118, 0)","v":0.2135907739830854},{"$f":"IF(O118<>0, (O118-O119)*C118, 0)","v":0.20568000457630445},0,{"$f":"Q118/Q$148","v":2.9742856234230952E-2},{"$f":"R118/R$148","v":4.5469260794607856E-2},{"$f":"S118/S$148","v":{"$error":"#DIV/0!"}},{"$f":"T118/T$148","v":0.23166393089549053},{"$f":"U118/U$148","v":0.25524922678673928},{"$error":"#DIV/0!"}]
[1,{"$f":"IF($B$114,'Raw data'!$D56,1)","v":0.94153846153846155},{"$f":"IF($B$114,'Raw data'!$D86,1)","v":0.95199999999999996},{"$f":"IF($B$114,'Raw data'!$D116,1)","v":0.85784615384615381},{"$f":"IF(AND($A119<E$107,OR(E$108=10,$A119<>8,$A119<>9)), INDEX('Raw data'!$B$155:$AE$182,E$112,$A119+1)-E$110, -1000)","v":0.23200000000000109},{"$f":"IF(AND($A119<F$107,OR(F$108=10,$A119<>8,$A119<>9)), INDEX('Raw data'!$B$155:$AE$182,F$112,$A119+1)-F$110, -1000)","v":0.23200000000000109},{"$f":"IF(AND($A119<G$107,OR(G$108=10,$A119<>8,$A119<>9)), INDEX('Raw data'!$B$155:$AE$182,G$112,$A119+1)-G$110, -1000)","v":-1000},{"$f":"IF(AND($A119<H$107,OR(H$108=10,$A119<>8,$A119<>9)), INDEX('Raw data'!$B$155:$AE$182,H$112,$A119+1)-H$110, -1000)","v":2.1230199999999999},{"$f":"IF(AND($A119<I$107,OR(I$108=10,$A119<>8,$A119<>9)), INDEX('Raw data'!$B$155:$AE$182,I$112,$A119+1)-I$110, -1000)","v":2.1230199999999999},{"$f":"IF(AND($A119<J$107,OR(J$108=10,$A119<>8,$A119<>9)), INDEX('Raw data'!$B$155:$AE$182,J$112,$A119+1)-J$110, -1000)","v":-1000},0.97227579420653998,0.97227579420653998,0,0.7731470537761348,0.7731470537761348,0,{"$f":"IF(K119<>0, (K119-K120)*B119, 0)","v":2.2895362383466379E-2},2.3149755298838226E-2,0,{"$f":"IF(N119<>0, (N119-N120)*B119, 0)","v":0.14751374338386614},0.1491527849770202,0,{"$f":"Q119/Q$148","v":2.6087533173717561E-2},4.1875261811557464E-2,{"$error":"#DIV/0!"},0.15999573865545968,0.18509885351713573,{"$error":"#DIV/0!"}]
[2,{"$f":"IF($B$114,'Raw data'!$D57,1)","v":0.94153846153846155},{"$f":"IF($B$114,'Raw data'!$D87,1)","v":0.96711111111111114},{"$f":"IF($B$114,'Raw data'!$D117,1)","v":0.57157175398633253},{"$f":"IF(AND($A120<E$107,OR(E$108=10,$A120<>8,$A120<>9)), INDEX('Raw data'!$B$155:$AE$182,E$112,$A120+1)-E$110, -1000)","v":0.44100000000000072},{"$f":"IF(AND($A120<F$107,OR(F$108=10,$A120<>8,$A120<>9)), INDEX('Raw data'!$B$155:$AE$182,F$112,$A120+1)-F$110, -1000)","v":0.44100000000000072},{"$f":"IF(AND($A120<G$107,OR(G$108=10,$A120<>8,$A120<>9)), INDEX('Raw data'!$B$155:$AE$182,G$112,$A120+1)-G$110, -1000)","v":-1000},{"$f":"IF(AND($A120<H$107,OR(H$108=10,$A120<>8,$A120<>9)), INDEX('Raw data'!$B$155:$AE$182,H$112,$A120+1)-H$110, -1000)","v":3.9916200000000002},{"$f":"IF(AND($A120<I$107,OR(I$108=10,$A120<>8,$A120<>9)), INDEX('Raw data'!$B$155:$AE$182,I$112,$A120+1)-I$110, -1000)","v":3.9916200000000002},{"$f":"IF(AND($A120<J$107,OR(J$108=10,$A120<>8,$A120<>9)), INDEX('Raw data'!$B$155:$AE$182,J$112,$A120+1)-J$110, -1000)","v":-1000},0.94795882435481915,0.94795882435481915,0,0.61647396031287827,0.61647396031287827,0,8.521433884118329E-2,8.7528802365264821E-2,0,0.17453191409842092,0.17927228707393358,0,9.7095291795910366E-2,0.15832960080063904,{"$error":"#DIV/0!"},0.18930007384099937,0.22247720557073353,{"$error":"#DIV/0!"}]
[3,{"$f":"IF($B$114,'Raw data'!$D58,1)","v":0.94153846153846155},{"$f":"IF($B$114,'Raw data'!$D88,1)","v":0.92933333333333334},{"$f":"IF($B$114,'Raw data'!$D118,1)","v":0.42892307692307691},{"$f":"IF(AND($A121<E$107,OR(E$108=10,$A121<>8,$A121<>9)), INDEX('Raw data'!$B$155:$AE$182,E$112,$A121+1)-E$110, -1000)","v":1.2690000000000001},{"$f":"IF(AND($A121<F$107,OR(F$108=10,$A121<>8,$A121<>9)), INDEX('Raw data'!$B$155:$AE$182,F$112,$A121+1)-F$110, -1000)","v":1.2690000000000001},{"$f":"IF(AND($A121<G$107,OR(G$108=10,$A121<>8,$A121<>9)), INDEX('Raw data'!$B$155:$AE$182,G$112,$A121+1)-G$110, -1000)","v":-1000},{"$f":"IF(AND($A121<H$107,OR(H$108=10,$A121<>8,$A121<>9)), INDEX('Raw data'!$B$155:$AE$182,H$112,$A121+1)-H$110, -1000)","v":6.94292},{"$f":"IF(AND($A121<I$107,OR(I$108=10,$A121<>8,$A121<>9)), INDEX('Raw data'!$B$155:$AE$182,I$112,$A121+1)-I$110, -1000)","v":6.94292},{"$f":"IF(AND($A121<J$107,OR(J$108=10,$A121<>8,$A121<>9)), INDEX('Raw data'!$B$155:$AE$182,J$112,$A121+1)-J$110, -1000)","v":-1000},0.85745339911500029,0.85745339911500029,0,0.43110509729984953,0.43110509729984953,0,4.700614974364898E-2,4.6396810765490563E-2,0,0.14062467990313129,0.13880176738586847,0,5.3559951149395997E-2,8.3926528507353548E-2,{"$error":"#DIV/0!"},0.15252375146999264,0.17225322351999503,{"$error":"#DIV/0!"}]
[4,{"$f":"IF($B$114,'Raw data'!$D59,1)","v":0.97292307692307689},{"$f":"IF($B$114,'Raw data'!$D89,1)","v":0.61955555555555553},{"$f":"IF($B$114,'Raw data'!$D119,1)","v":0.28594871794871796},{"$f":"IF(AND($A122<E$107,OR(E$108=10,$A122<>8,$A122<>9)), INDEX('Raw data'!$B$155:$AE$182,E$112,$A122+1)-E$110, -1000)","v":1.7640000000000011},{"$f":"IF(AND($A122<F$107,OR(F$108=10,$A122<>8,$A122<>9)), INDEX('Raw data'!$B$155:$AE$182,F$112,$A122+1)-F$110, -1000)","v":1.7640000000000011},{"$f":"IF(AND($A122<G$107,OR(G$108=10,$A122<>8,$A122<>9)), INDEX('Raw data'!$B$155:$AE$182,G$112,$A122+1)-G$110, -1000)","v":-1000},{"$f":"IF(AND($A122<H$107,OR(H$108=10,$A122<>8,$A122<>9)), INDEX('Raw data'!$B$155:$AE$182,H$112,$A122+1)-H$110, -1000)","v":10.45262},{"$f":"IF(AND($A122<I$107,OR(I$108=10,$A122<>8,$A122<>9)), INDEX('Raw data'!$B$155:$AE$182,I$112,$A122+1)-I$110, -1000)","v":10.45262},{"$f":"IF(AND($A122<J$107,OR(J$108=10,$A122<>8,$A122<>9)), INDEX('Raw data'!$B$155:$AE$182,J$112,$A122+1)-J$110, -1000)","v":-1000},0.80752856687092867,0.80752856687092867,0,0.28174881962495518,0.28174881962495518,0,0.227295063666939,0.1447410620483614,0,9.3886498950351671E-2,5.9786743059184515E-2,0,0.25898552791265206,0.26182004042445289,{"$error":"#DIV/0!"},0.10183078135470515,7.419544728905747E-2,{"$error":"#DIV/0!"}]
[5,{"$f":"IF($B$114,'Raw data'!$D60,1)","v":0.96507692307692305},{"$f":"IF($B$114,'Raw data'!$D90,1)","v":0.46466666666666667},{"$f":"IF($B$114,'Raw data'!$D120,1)","v":0.21446153846153845},{"$f":"IF(AND($A123<E$107,OR(E$108=10,$A123<>8,$A123<>9)), INDEX('Raw data'!$B$155:$AE$182,E$112,$A123+1)-E$110, -1000)","v":4.5820000000000007},{"$f":"IF(AND($A123<F$107,OR(F$108=10,$A123<>8,$A123<>9)), INDEX('Raw data'!$B$155:$AE$182,F$112,$A123+1)-F$110, -1000)","v":4.5820000000000007},{"$f":"IF(AND($A123<G$107,OR(G$108=10,$A123<>8,$A123<>9)), INDEX('Raw data'!$B$155:$AE$182,G$112,$A123+1)-G$110, -1000)","v":-1000},{"$f":"IF(AND($A123<H$107,OR(H$108=10,$A123<>8,$A123<>9)), INDEX('Raw data'!$B$155:$AE$182,H$112,$A123+1)-H$110, -1000)","v":13.91262},{"$f":"IF(AND($A123<I$107,OR(I$108=10,$A123<>8,$A123<>9)), INDEX('Raw data'!$B$155:$AE$182,I$112,$A123+1)-I$110, -1000)","v":13.91262},{"$f":"IF(AND($A123<J$107,OR(J$108=10,$A123<>8,$A123<>9)), INDEX('Raw data'!$B$155:$AE$182,J$112,$A123+1)-J$110, -1000)","v":-1000},0.5739077708818231,0.5739077708818231,0,0.18524941368294287,0.18524941368294287,0,9.5241261896568064E-2,4.5856903876125371E-2,0,3.2064207912153565E-2,1.543832232807394E-2,0,0.10852021198090639,8.2949898644351677E-2,{"$error":"#DIV/0!"},3.4777346921211254E-2,1.9158983612640915E-2,{"$error":"#DIV/0!"}]
[6,{"$f":"IF($B$114,'Raw data'!$D61,1)","v":0.85784615384615381},{"$f":"IF($B$114,'Raw data'!$D91,1)","v":0.41303703703703704},{"$f":"IF($B$114,'Raw data'!$D121,1)","v":0.19016294050776814},{"$f":"IF(AND($A124<E$107,OR(E$108=10,$A124<>8,$A124<>9)), INDEX('Raw data'!$B$155:$AE$182,E$112,$A124+1)-E$110, -1000)","v":6.1389999999999993},{"$f":"IF(AND($A124<F$107,OR(F$108=10,$A124<>8,$A124<>9)), INDEX('Raw data'!$B$155:$AE$182,F$112,$A124+1)-F$110, -1000)","v":6.1389999999999993},{"$f":"IF(AND($A124<G$107,OR(G$108=10,$A124<>8,$A124<>9)), INDEX('Raw data'!$B$155:$AE$182,G$112,$A124+1)-G$110, -1000)","v":-1000},{"$f":"IF(AND($A124<H$107,OR(H$108=10,$A124<>8,$A124<>9)), INDEX('Raw data'!$B$155:$AE$182,H$112,$A124+1)-H$110, -1000)","v":15.543619999999999},{"$f":"IF(AND($A124<I$107,OR(I$108=10,$A124<>8,$A124<>9)), INDEX('Raw data'!$B$155:$AE$182,I$112,$A124+1)-I$110, -1000)","v":15.543619999999999},{"$f":"IF(AND($A124<J$107,OR(J$108=10,$A124<>8,$A124<>9)), INDEX('Raw data'!$B$155:$AE$182,J$112,$A124+1)-J$110, -1000)","v":-1000},0.47522002939805258,0.47522002939805258,0,0.1520249036512199,0.1520249036512199,0,6.9814682854304755E-2,3.3614476929850437E-2,0,2.4010525311707512E-2,1.1560623298229543E-2,0,7.9548548936245342E-2,6.0804747347229487E-2,{"$error":"#DIV/0!"},2.6042195422805708E-2,1.4346752685680406E-2,{"$error":"#DIV/0!"}]
[7,{"$f":"IF($B$114,'Raw data'!$D62,1)","v":0.77206153846153847},{"$f":"IF($B$114,'Raw data'!$D92,1)","v":0.37173333333333336},{"$f":"IF($B$114,'Raw data'!$D122,1)","v":0.17156923076923078},{"$f":"IF(AND($A125<E$107,OR(E$108=10,$A125<>8,$A125<>9)), INDEX('Raw data'!$B$155:$AE$182,E$112,$A125+1)-E$110, -1000)","v":7.6890000000000001},{"$f":"IF(AND($A125<F$107,OR(F$108=10,$A125<>8,$A125<>9)), INDEX('Raw data'!$B$155:$AE$182,F$112,$A125+1)-F$110, -1000)","v":7.6890000000000001},{"$f":"IF(AND($A125<G$107,OR(G$108=10,$A125<>8,$A125<>9)), INDEX('Raw data'!$B$155:$AE$182,G$112,$A125+1)-G$110, -1000)","v":-1000},{"$f":"IF(AND($A125<H$107,OR(H$108=10,$A125<>8,$A125<>9)), INDEX('Raw data'!$B$155:$AE$182,H$112,$A125+1)-H$110, -1000)","v":17.222620000000003},{"$f":"IF(AND($A125<I$107,OR(I$108=10,$A125<>8,$A125<>9)), INDEX('Raw data'!$B$155:$AE$182,I$112,$A125+1)-I$110, -1000)","v":17.222620000000003},{"$f":"IF(AND($A125<J$107,OR(J$108=10,$A125<>8,$A125<>9)), INDEX('Raw data'!$B$155:$AE$182,J$112,$A125+1)-J$110, -1000)","v":-1000},0.39383634242657106,0.39383634242657106,0,0.12403558971181911,0.12403558971181911,0,0.30406589243592375,0.14640209635803736,0,9.5763108216891227E-2,4.6108163215540225E-2,0,0.34646007881694141,0.26482466166980795,{"$error":"#DIV/0!"},0.10386618143933561,5.7220307018017648E-2,{"$error":"#DIV/0!"}]
[8,{"$f":"IF($B$114,'Raw data'!$D63,1)","v":0.64338461538461533},{"$f":"IF($B$114,'Raw data'!$D93,1)","v":0.30977777777777776},{"$f":"IF($B$114,'Raw data'!$D123,1)","v":0.14297435897435898},{"$f":"IF(AND($A126<E$107,OR(E$108=10,$A126<>8,$A126<>9)), INDEX('Raw data'!$B$155:$AE$182,E$112,$A126+1)-E$110, -1000)","v":-1000},{"$f":"IF(AND($A126<F$107,OR(F$108=10,$A126<>8,$A126<>9)), INDEX('Raw data'!$B$155:$AE$182,F$112,$A126+1)-F$110, -1000)","v":-1000},{"$f":"IF(AND($A126<G$107,OR(G$108=10,$A126<>8,$A126<>9)), INDEX('Raw data'!$B$155:$AE$182,G$112,$A126+1)-G$110, -1000)","v":-1000},{"$f":"IF(AND($A126<H$107,OR(H$108=10,$A126<>8,$A126<>9)), INDEX('Raw data'!$B$155:$AE$182,H$112,$A126+1)-H$110, -1000)","v":-1000},{"$f":"IF(AND($A126<I$107,OR(I$108=10,$A126<>8,$A126<>9)), INDEX('Raw data'!$B$155:$AE$182,I$112,$A126+1)-I$110, -1000)","v":-1000},{"$f":"IF(AND($A126<J$107,OR(J$108=10,$A126<>8,$A126<>9)), INDEX('Raw data'!$B$155:$AE$182,J$112,$A126+1)-J$110, -1000)","v":-1000},0,0,0,0,0,0,0,0,0,0,0,0,0,0,{"$error":"#DIV/0!"},0,0,{"$error":"#DIV/0!"}]
[9,{"$f":"IF($B$114,'Raw data'!$D64,1)","v":{"$error":"#DIV/0!"}},{"$f":"IF($B$114,'Raw data'!$D94,1)","v":0.27879999999999999},{"$f":"IF($B$114,'Raw data'!$D124,1)","v":0.12867692307692308},{"$f":"IF(AND($A127<E$107,OR(E$108=10,$A127<>8,$A127<>9)), INDEX('Raw data'!$B$155:$AE$182,E$112,$A127+1)-E$110, -1000)","v":-1000},{"$f":"IF(AND($A127<F$107,OR(F$108=10,$A127<>8,$A127<>9)), INDEX('Raw data'!$B$155:$AE$182,F$112,$A127+1)-F$110, -1000)","v":-1000},{"$f":"IF(AND($A127<G$107,OR(G$108=10,$A127<>8,$A127<>9)), INDEX('Raw data'!$B$155:$AE$182,G$112,$A127+1)-G$110, -1000)","v":-1000},{"$f":"IF(AND($A127<H$107,OR(H$108=10,$A127<>8,$A127<>9)), INDEX('Raw data'!$B$155:$AE$182,H$112,$A127+1)-H$110, -1000)","v":-1000},{"$f":"IF(AND($A127<I$107,OR(I$108=10,$A127<>8,$A127<>9)), INDEX('Raw data'!$B$155:$AE$182,I$112,$A127+1)-I$110, -1000)","v":-1000},{"$f":"IF(AND($A127<J$107,OR(J$108=10,$A127<>8,$A127<>9)), INDEX('Raw data'!$B$155:$AE$182,J$112,$A127+1)-J$110, -1000)","v":-1000},0,0,0,0,0,0,{"$f":"IF(K127<>0, (K127)*B127, 0)","v":0},{"$f":"IF(L127<>0, (L127)*C127, 0)","v":0},0,{"$f":"IF(N127<>0, (N127)*B127, 0)","v":0},{"$f":"IF(O127<>0, (O127)*C127, 0)","v":0},0,0,0,{"$error":"#DIV/0!"},0,0,{"$error":"#DIV/0!"}]
[10,{"$f":"IF($B$114,'Raw data'!$D65,1)","v":0.94153846153846155},{"$f":"IF($B$114,'Raw data'!$D95,1)","v":0.95199999999999996},{"$f":"IF($B$114,'Raw data'!$D125,1)","v":0.856382252559727},{"$f":"IF(AND($A128<E$107,OR(E$108=10,$A128<>8,$A128<>9)), INDEX('Raw data'!$B$155:$AE$182,E$112,$A128+1)-E$110, -1000)","v":-1000},{"$f":"IF(AND($A128<F$107,OR(F$108=10,$A128<>8,$A128<>9)), INDEX('Raw data'!$B$155:$AE$182,F$112,$A128+1)-F$110, -1000)","v":-1000},{"$f":"IF(AND($A128<G$107,OR(G$108=10,$A128<>8,$A128<>9)), INDEX('Raw data'!$B$155:$AE$182,G$112,$A128+1)-G$110, -1000)","v":-1000},{"$f":"IF(AND($A128<H$107,OR(H$108=10,$A128<>8,$A128<>9)), INDEX('Raw data'!$B$155:$AE$182,H$112,$A128+1)-H$110, -1000)","v":-1000},{"$f":"IF(AND($A128<I$107,OR(I$108=10,$A128<>8,$A128<>9)), INDEX('Raw data'!$B$155:$AE$182,I$112,$A128+1)-I$110, -1000)","v":-1000},{"$f":"IF(AND($A128<J$107,OR(J$108=10,$A128<>8,$A128<>9)), INDEX('Raw data'!$B$155:$AE$182,J$112,$A128+1)-J$110, -1000)","v":-1000},0,0,0,0,0,0,0,0,0,0,0,0,0,0,{"$error":"#DIV/0!"},0,0,{"$error":"#DIV/0!"}]
[11,{"$f":"IF($B$114,'Raw data'!$D66,1)","v":0.94153846153846155},{"$f":"IF($B$114,'Raw data'!$D96,1)","v":0.92933333333333334},{"$f":"IF($B$114,'Raw data'!$D126,1)","v":0.42892307692307691},{"$f":"IF(AND($A129<E$107,OR(E$108=10,$A129<>8,$A129<>9)), INDEX('Raw data'!$B$155:$AE$182,E$112,$A129+1)-E$110, -1000)","v":-1000},{"$f":"IF(AND($A129<F$107,OR(F$108=10,$A129<>8,$A129<>9)), INDEX('Raw data'!$B$155:$AE$182,F$112,$A129+1)-F$110, -1000)","v":-1000},{"$f":"IF(AND($A129<G$107,OR(G$108=10,$A129<>8,$A129<>9)), INDEX('Raw data'!$B$155:$AE$182,G$112,$A129+1)-G$110, -1000)","v":-1000},{"$f":"IF(AND($A129<H$107,OR(H$108=10,$A129<>8,$A129<>9)), INDEX('Raw data'!$B$155:$AE$182,H$112,$A129+1)-H$110, -1000)","v":-1000},{"$f":"IF(AND($A129<I$107,OR(I$108=10,$A129<>8,$A129<>9)), INDEX('Raw data'!$B$155:$AE$182,I$112,$A129+1)-I$110, -1000)","v":-1000},{"$f":"IF(AND($A129<J$107,OR(J$108=10,$A129<>8,$A129<>9)), INDEX('Raw data'!$B$155:$AE$182,J$112,$A129+1)-J$110, -1000)","v":-1000},0,0,0,0,0,0,0,0,0,0,0,0,0,0,{"$error":"#DIV/0!"},0,0,{"$error":"#DIV/0!"}]
[12,{"$f":"IF($B$114,'Raw data'!$D67,1)","v":0.97292307692307689},{"$f":"IF($B$114,'Raw data'!$D97,1)","v":0.61955555555555553},{"$f":"IF($B$114,'Raw data'!$D127,1)","v":0.28578587699316627},{"$f":"IF(AND($A130<E$107,OR(E$108=10,$A130<>8,$A130<>9)), INDEX('Raw data'!$B$155:$AE$182,E$112,$A130+1)-E$110, -1000)","v":-1000},{"$f":"IF(AND($A130<F$107,OR(F$108=10,$A130<>8,$A130<>9)), INDEX('Raw data'!$B$155:$AE$182,F$112,$A130+1)-F$110, -1000)","v":-1000},{"$f":"IF(AND($A130<G$107,OR(G$108=10,$A130<>8,$A130<>9)), INDEX('Raw data'!$B$155:$AE$182,G$112,$A130+1)-G$110, -1000)","v":-1000},{"$f":"IF(AND($A130<H$107,OR(H$108=10,$A130<>8,$A130<>9)), INDEX('Raw data'!$B$155:$AE$182,H$112,$A130+1)-H$110, -1000)","v":-1000},{"$f":"IF(AND($A130<I$107,OR(I$108=10,$A130<>8,$A130<>9)), INDEX('Raw data'!$B$155:$AE$182,I$112,$A130+1)-I$110, -1000)","v":-1000},{"$f":"IF(AND($A130<J$107,OR(J$108=10,$A130<>8,$A130<>9)), INDEX('Raw data'!$B$155:$AE$182,J$112,$A130+1)-J$110, -1000)","v":-1000},0,0,0,0,0,0,0,0,0,0,0,0,0,0,{"$error":"#DIV/0!"},0,0,{"$error":"#DIV/0!"}]
[13,{"$f":"IF($B$114,'Raw data'!$D68,1)","v":0.96507692307692305},{"$f":"IF($B$114,'Raw data'!$D98,1)","v":0.46466666666666667},{"$f":"IF($B$114,'Raw data'!$D128,1)","v":0.21446153846153845},{"$f":"IF(AND($A131<E$107,OR(E$108=10,$A131<>8,$A131<>9)), INDEX('Raw data'!$B$155:$AE$182,E$112,$A131+1)-E$110, -1000)","v":-1000},{"$f":"IF(AND($A131<F$107,OR(F$108=10,$A131<>8,$A131<>9)), INDEX('Raw data'!$B$155:$AE$182,F$112,$A131+1)-F$110, -1000)","v":-1000},{"$f":"IF(AND($A131<G$107,OR(G$108=10,$A131<>8,$A131<>9)), INDEX('Raw data'!$B$155:$AE$182,G$112,$A131+1)-G$110, -1000)","v":-1000},{"$f":"IF(AND($A131<H$107,OR(H$108=10,$A131<>8,$A131<>9)), INDEX('Raw data'!$B$155:$AE$182,H$112,$A131+1)-H$110, -1000)","v":-1000},{"$f":"IF(AND($A131<I$107,OR(I$108=10,$A131<>8,$A131<>9)), INDEX('Raw data'!$B$155:$AE$182,I$112,$A131+1)-I$110, -1000)","v":-1000},{"$f":"IF(AND($A131<J$107,OR(J$108=10,$A131<>8,$A131<>9)), INDEX('Raw data'!$B$155:$AE$182,J$112,$A131+1)-J$110, -1000)","v":-1000},0,0,0,0,0,0,0,0,0,0,0,0,0,0,{"$error":"#DIV/0!"},0,0,{"$error":"#DIV/0!"}]
[14,{"$f":"IF($B$114,'Raw data'!$D69,1)","v":0.64338461538461533},{"$f":"IF($B$114,'Raw data'!$D99,1)","v":0.30977777777777776},{"$f":"IF($B$114,'Raw data'!$D129,1)","v":0.14297435897435898},{"$f":"IF(AND($A132<E$107,OR(E$108=10,$A132<>8,$A132<>9)), INDEX('Raw data'!$B$155:$AE$182,E$112,$A132+1)-E$110, -1000)","v":-1000},{"$f":"IF(AND($A132<F$107,OR(F$108=10,$A132<>8,$A132<>9)), INDEX('Raw data'!$B$155:$AE$182,F$112,$A132+1)-F$110, -1000)","v":-1000},{"$f":"IF(AND($A132<G$107,OR(G$108=10,$A132<>8,$A132<>9)), INDEX('Raw data'!$B$155:$AE$182,G$112,$A132+1)-G$110, -1000)","v":-1000},{"$f":"IF(AND($A132<H$107,OR(H$108=10,$A132<>8,$A132<>9)), INDEX('Raw data'!$B$155:$AE$182,H$112,$A132+1)-H$110, -1000)","v":-1000},{"$f":"IF(AND($A132<I$107,OR(I$108=10,$A132<>8,$A132<>9)), INDEX('Raw data'!$B$155:$AE$182,I$112,$A132+1)-I$110, -1000)","v":-1000},{"$f":"IF(AND($A132<J$107,OR(J$108=10,$A132<>8,$A132<>9)), INDEX('Raw data'!$B$155:$AE$182,J$112,$A132+1)-J$110, -1000)","v":-1000},0,0,0,0,0,0,0,0,0,0,0,0,0,0,{"$error":"#DIV/0!"},0,0,{"$error":"#DIV/0!"}]
[15,{"$f":"IF($B$114,'Raw data'!$D70,1)","v":0.48253846153846153},{"$f":"IF($B$114,'Raw data'!$D100,1)","v":0.23233333333333334},{"$f":"IF($B$114,'Raw data'!$D130,1)","v":0.10723076923076923},{"$f":"IF(AND($A133<E$107,OR(E$108=10,$A133<>8,$A133<>9)), INDEX('Raw data'!$B$155:$AE$182,E$112,$A133+1)-E$110, -1000)","v":-1000},{"$f":"IF(AND($A133<F$107,OR(F$108=10,$A133<>8,$A133<>9)), INDEX('Raw data'!$B$155:$AE$182,F$112,$A133+1)-F$110, -1000)","v":-1000},{"$f":"IF(AND($A133<G$107,OR(G$108=10,$A133<>8,$A133<>9)), INDEX('Raw data'!$B$155:$AE$182,G$112,$A133+1)-G$110, -1000)","v":-1000},{"$f":"IF(AND($A133<H$107,OR(H$108=10,$A133<>8,$A133<>9)), INDEX('Raw data'!$B$155:$AE$182,H$112,$A133+1)-H$110, -1000)","v":-1000},{"$f":"IF(AND($A133<I$107,OR(I$108=10,$A133<>8,$A133<>9)), INDEX('Raw data'!$B$155:$AE$182,I$112,$A133+1)-I$110, -1000)","v":-1000},{"$f":"IF(AND($A133<J$107,OR(J$108=10,$A133<>8,$A133<>9)), INDEX('Raw data'!$B$155:$AE$182,J$112,$A133+1)-J$110, -1000)","v":-1000},0,0,0,0,0,0,0,0,0,0,0,0,0,0,{"$error":"#DIV/0!"},0,0,{"$error":"#DIV/0!"}]
[16,{"$f":"IF($B$114,'Raw data'!$D71,1)","v":0.42892307692307691},{"$f":"IF($B$114,'Raw data'!$D101,1)","v":0.20651851851851852},{"$f":"IF($B$114,'Raw data'!$D131,1)","v":9.5081470253884068E-2},{"$f":"IF(AND($A134<E$107,OR(E$108=10,$A134<>8,$A134<>9)), INDEX('Raw data'!$B$155:$AE$182,E$112,$A134+1)-E$110, -1000)","v":-1000},{"$f":"IF(AND($A134<F$107,OR(F$108=10,$A134<>8,$A134<>9)), INDEX('Raw data'!$B$155:$AE$182,F$112,$A134+1)-F$110, -1000)","v":-1000},{"$f":"IF(AND($A134<G$107,OR(G$108=10,$A134<>8,$A134<>9)), INDEX('Raw data'!$B$155:$AE$182,G$112,$A134+1)-G$110, -1000)","v":-1000},{"$f":"IF(AND($A134<H$107,OR(H$108=10,$A134<>8,$A134<>9)), INDEX('Raw data'!$B$155:$AE$182,H$112,$A134+1)-H$110, -1000)","v":-1000},{"$f":"IF(AND($A134<I$107,OR(I$108=10,$A134<>8,$A134<>9)), INDEX('Raw data'!$B$155:$AE$182,I$112,$A134+1)-I$110, -1000)","v":-1000},{"$f":"IF(AND($A134<J$107,OR(J$108=10,$A134<>8,$A134<>9)), INDEX('Raw data'!$B$155:$AE$182,J$112,$A134+1)-J$110, -1000)","v":-1000},{"$f":"IF(E134>=0,(10^(-E134/(10*E$111)))^2,0)","v":0},0,0,0,0,0,0,0,0,0,0,0,0,0,{"$error":"#DIV/0!"},0,0,{"$error":"#DIV/0!"}]
[17,{"$f":"IF($B$114,'Raw data'!$D72,1)","v":0.38603076923076923},{"$f":"IF($B$114,'Raw data'!$D102,1)","v":0.18586666666666668},{"$f":"IF($B$114,'Raw data'!$D132,1)","v":8.578461538461539E-2},{"$f":"IF(AND($A135<E$107,OR(E$108=10,$A135<>8,$A135<>9)), INDEX('Raw data'!$B$155:$AE$182,E$112,$A135+1)-E$110, -1000)","v":-1000},{"$f":"IF(AND($A135<F$107,OR(F$108=10,$A135<>8,$A135<>9)), INDEX('Raw data'!$B$155:$AE$182,F$112,$A135+1)-F$110, -1000)","v":-1000},{"$f":"IF(AND($A135<G$107,OR(G$108=10,$A135<>8,$A135<>9)), INDEX('Raw data'!$B$155:$AE$182,G$112,$A135+1)-G$110, -1000)","v":-1000},{"$f":"IF(AND($A135<H$107,OR(H$108=10,$A135<>8,$A135<>9)), INDEX('Raw data'!$B$155:$AE$182,H$112,$A135+1)-H$110, -1000)","v":-1000},{"$f":"IF(AND($A135<I$107,OR(I$108=10,$A135<>8,$A135<>9)), INDEX('Raw data'!$B$155:$AE$182,I$112,$A135+1)-I$110, -1000)","v":-1000},{"$f":"IF(AND($A135<J$107,OR(J$108=10,$A135<>8,$A135<>9)), INDEX('Raw data'!$B$155:$AE$182,J$112,$A135+1)-J$110, -1000)","v":-1000},0,0,0,0,0,0,0,0,0,0,0,0,0,0,{"$error":"#DIV/0!"},0,0,{"$error":"#DIV/0!"}]
[18,{"$f":"IF($B$114,'Raw data'!$D73,1)","v":0.32169230769230767},{"$f":"IF($B$114,'Raw data'!$D103,1)","v":0.15488888888888888},{"$f":"IF($B$114,'Raw data'!$D133,1)","v":7.1487179487179489E-2},{"$f":"IF(AND($A136<E$107,OR(E$108=10,$A136<>8,$A136<>9)), INDEX('Raw data'!$B$155:$AE$182,E$112,$A136+1)-E$110, -1000)","v":-1000},{"$f":"IF(AND($A136<F$107,OR(F$108=10,$A136<>8,$A136<>9)), INDEX('Raw data'!$B$155:$AE$182,F$112,$A136+1)-F$110, -1000)","v":-1000},{"$f":"IF(AND($A136<G$107,OR(G$108=10,$A136<>8,$A136<>9)), INDEX('Raw data'!$B$155:$AE$182,G$112,$A136+1)-G$110, -1000)","v":-1000},{"$f":"IF(AND($A136<H$107,OR(H$108=10,$A136<>8,$A136<>9)), INDEX('Raw data'!$B$155:$AE$182,H$112,$A136+1)-H$110, -1000)","v":-1000},{"$f":"IF(AND($A136<I$107,OR(I$108=10,$A136<>8,$A136<>9)), INDEX('Raw data'!$B$155:$AE$182,I$112,$A136+1)-I$110, -1000)","v":-1000},{"$f":"IF(AND($A136<J$107,OR(J$108=10,$A136<>8,$A136<>9)), INDEX('Raw data'!$B$155:$AE$182,J$112,$A136+1)-J$110, -1000)","v":-1000},0,0,0,0,0,0,0,0,0,0,0,0,0,0,{"$error":"#DIV/0!"},0,0,{"$error":"#DIV/0!"}]
[19,{"$f":"IF($B$114,'Raw data'!$D74,1)","v":{"$error":"#DIV/0!"}},{"$f":"IF($B$114,'Raw data'!$D104,1)","v":0.1394},{"$f":"IF($B$114,'Raw data'!$D134,1)","v":6.4338461538461539E-2},{"$f":"IF(AND($A137<E$107,OR(E$108=10,$A137<>8,$A137<>9)), INDEX('Raw data'!$B$155:$AE$182,E$112,$A137+1)-E$110, -1000)","v":-1000},{"$f":"IF(AND($A137<F$107,OR(F$108=10,$A137<>8,$A137<>9)), INDEX('Raw data'!$B$155:$AE$182,F$112,$A137+1)-F$110, -1000)","v":-1000},{"$f":"IF(AND($A137<G$107,OR(G$108=10,$A137<>8,$A137<>9)), INDEX('Raw data'!$B$155:$AE$182,G$112,$A137+1)-G$110, -1000)","v":-1000},{"$f":"IF(AND($A137<H$107,OR(H$108=10,$A137<>8,$A137<>9)), INDEX('Raw data'!$B$155:$AE$182,H$112,$A137+1)-H$110, -1000)","v":-1000},{"$f":"IF(AND($A137<I$107,OR(I$108=10,$A137<>8,$A137<>9)), INDEX('Raw data'!$B$155:$AE$182,I$112,$A137+1)-I$110, -1000)","v":-1000},{"$f":"IF(AND($A137<J$107,OR(J$108=10,$A137<>8,$A137<>9)), INDEX('Raw data'!$B$155:$AE$182,J$112,$A137+1)-J$110, -1000)","v":-1000},0,0,0,0,0,0,{"$f":"IF(K137<>0, (K137)*B137, 0)","v":0},{"$f":"IF(L137<>0, (L137)*C137, 0)","v":0},0,{"$f":"IF(N137<>0, (N137)*B137, 0)","v":0},{"$f":"IF(O137<>0, (O137)*C137, 0)","v":0},0,0,0,{"$error":"#DIV/0!"},0,0,{"$error":"#DIV/0!"}]
[20,{"$f":"IF($B$114,'Raw data'!$D75,1)","v":0.95889400921658985},{"$f":"IF($B$114,'Raw data'!$D105,1)","v":0.95199999999999996},{"$f":"IF($B$114,'Raw data'!$D135,1)","v":0.57092150170648459},{"$f":"IF(AND($A138<E$107,OR(E$108=10,$A138<>8,$A138<>9)), INDEX('Raw data'!$B$155:$AE$182,E$112,$A138+1)-E$110, -1000)","v":-1000},{"$f":"IF(AND($A138<F$107,OR(F$108=10,$A138<>8,$A138<>9)), INDEX('Raw data'!$B$155:$AE$182,F$112,$A138+1)-F$110, -1000)","v":-1000},{"$f":"IF(AND($A138<G$107,OR(G$108=10,$A138<>8,$A138<>9)), INDEX('Raw data'!$B$155:$AE$182,G$112,$A138+1)-G$110, -1000)","v":-1000},{"$f":"IF(AND($A138<H$107,OR(H$108=10,$A138<>8,$A138<>9)), INDEX('Raw data'!$B$155:$AE$182,H$112,$A138+1)-H$110, -1000)","v":-1000},{"$f":"IF(AND($A138<I$107,OR(I$108=10,$A138<>8,$A138<>9)), INDEX('Raw data'!$B$155:$AE$182,I$112,$A138+1)-I$110, -1000)","v":-1000},{"$f":"IF(AND($A138<J$107,OR(J$108=10,$A138<>8,$A138<>9)), INDEX('Raw data'!$B$155:$AE$182,J$112,$A138+1)-J$110, -1000)","v":-1000},0,0,0,0,0,0,0,0,0,0,0,0,0,0,{"$error":"#DIV/0!"},0,0,{"$error":"#DIV/0!"}]
[21,{"$f":"IF($B$114,'Raw data'!$D76,1)","v":0.96110854503464205},{"$f":"IF($B$114,'Raw data'!$D106,1)","v":0.55759999999999998},{"$f":"IF($B$114,'Raw data'!$D136,1)","v":0.28594871794871796},{"$f":"IF(AND($A139<E$107,OR(E$108=10,$A139<>8,$A139<>9)), INDEX('Raw data'!$B$155:$AE$182,E$112,$A139+1)-E$110, -1000)","v":-1000},{"$f":"IF(AND($A139<F$107,OR(F$108=10,$A139<>8,$A139<>9)), INDEX('Raw data'!$B$155:$AE$182,F$112,$A139+1)-F$110, -1000)","v":-1000},{"$f":"IF(AND($A139<G$107,OR(G$108=10,$A139<>8,$A139<>9)), INDEX('Raw data'!$B$155:$AE$182,G$112,$A139+1)-G$110, -1000)","v":-1000},{"$f":"IF(AND($A139<H$107,OR(H$108=10,$A139<>8,$A139<>9)), INDEX('Raw data'!$B$155:$AE$182,H$112,$A139+1)-H$110, -1000)","v":-1000},{"$f":"IF(AND($A139<I$107,OR(I$108=10,$A139<>8,$A139<>9)), INDEX('Raw data'!$B$155:$AE$182,I$112,$A139+1)-I$110, -1000)","v":-1000},{"$f":"IF(AND($A139<J$107,OR(J$108=10,$A139<>8,$A139<>9)), INDEX('Raw data'!$B$155:$AE$182,J$112,$A139+1)-J$110, -1000)","v":-1000},0,0,0,0,0,0,0,0,0,0,0,0,0,0,{"$error":"#DIV/0!"},0,0,{"$error":"#DIV/0!"}]
[22,{"$f":"IF($B$114,'Raw data'!$D77,1)","v":0.77206153846153847},{"$f":"IF($B$114,'Raw data'!$D107,1)","v":0.37173333333333336},{"$f":"IF($B$114,'Raw data'!$D137,1)","v":0.19052391799544421},{"$f":"IF(AND($A140<E$107,OR(E$108=10,$A140<>8,$A140<>9)), INDEX('Raw data'!$B$155:$AE$182,E$112,$A140+1)-E$110, -1000)","v":-1000},{"$f":"IF(AND($A140<F$107,OR(F$108=10,$A140<>8,$A140<>9)), INDEX('Raw data'!$B$155:$AE$182,F$112,$A140+1)-F$110, -1000)","v":-1000},{"$f":"IF(AND($A140<G$107,OR(G$108=10,$A140<>8,$A140<>9)), INDEX('Raw data'!$B$155:$AE$182,G$112,$A140+1)-G$110, -1000)","v":-1000},{"$f":"IF(AND($A140<H$107,OR(H$108=10,$A140<>8,$A140<>9)), INDEX('Raw data'!$B$155:$AE$182,H$112,$A140+1)-H$110, -1000)","v":-1000},{"$f":"IF(AND($A140<I$107,OR(I$108=10,$A140<>8,$A140<>9)), INDEX('Raw data'!$B$155:$AE$182,I$112,$A140+1)-I$110, -1000)","v":-1000},{"$f":"IF(AND($A140<J$107,OR(J$108=10,$A140<>8,$A140<>9)), INDEX('Raw data'!$B$155:$AE$182,J$112,$A140+1)-J$110, -1000)","v":-1000},0,0,0,0,0,0,0,0,0,0,0,0,0,0,{"$error":"#DIV/0!"},0,0,{"$error":"#DIV/0!"}]
[23,{"$f":"IF($B$114,'Raw data'!$D78,1)","v":0.57882352941176474},{"$f":"IF($B$114,'Raw data'!$D108,1)","v":0.26552380952380955},{"$f":"IF($B$114,'Raw data'!$D138,1)","v":0.14297435897435898},{"$f":"IF(AND($A141<E$107,OR(E$108=10,$A141<>8,$A141<>9)), INDEX('Raw data'!$B$155:$AE$182,E$112,$A141+1)-E$110, -1000)","v":-1000},{"$f":"IF(AND($A141<F$107,OR(F$108=10,$A141<>8,$A141<>9)), INDEX('Raw data'!$B$155:$AE$182,F$112,$A141+1)-F$110, -1000)","v":-1000},{"$f":"IF(AND($A141<G$107,OR(G$108=10,$A141<>8,$A141<>9)), INDEX('Raw data'!$B$155:$AE$182,G$112,$A141+1)-G$110, -1000)","v":-1000},{"$f":"IF(AND($A141<H$107,OR(H$108=10,$A141<>8,$A141<>9)), INDEX('Raw data'!$B$155:$AE$182,H$112,$A141+1)-H$110, -1000)","v":-1000},{"$f":"IF(AND($A141<I$107,OR(I$108=10,$A141<>8,$A141<>9)), INDEX('Raw data'!$B$155:$AE$182,I$112,$A141+1)-I$110, -1000)","v":-1000},{"$f":"IF(AND($A141<J$107,OR(J$108=10,$A141<>8,$A141<>9)), INDEX('Raw data'!$B$155:$AE$182,J$112,$A141+1)-J$110, -1000)","v":-1000},0,0,0,0,0,0,0,0,0,0,0,0,0,0,{"$error":"#DIV/0!"},0,0,{"$error":"#DIV/0!"}]
[24,{"$f":"IF($B$114,'Raw data'!$D79,1)","v":0.38603076923076923},{"$f":"IF($B$114,'Raw data'!$D109,1)","v":0.18586666666666668},{"$f":"IF($B$114,'Raw data'!$D139,1)","v":9.531623931623931E-2},{"$f":"IF(AND($A142<E$107,OR(E$108=10,$A142<>8,$A142<>9)), INDEX('Raw data'!$B$155:$AE$182,E$112,$A142+1)-E$110, -1000)","v":-1000},{"$f":"IF(AND($A142<F$107,OR(F$108=10,$A142<>8,$A142<>9)), INDEX('Raw data'!$B$155:$AE$182,F$112,$A142+1)-F$110, -1000)","v":-1000},{"$f":"IF(AND($A142<G$107,OR(G$108=10,$A142<>8,$A142<>9)), INDEX('Raw data'!$B$155:$AE$182,G$112,$A142+1)-G$110, -1000)","v":-1000},{"$f":"IF(AND($A142<H$107,OR(H$108=10,$A142<>8,$A142<>9)), INDEX('Raw data'!$B$155:$AE$182,H$112,$A142+1)-H$110, -1000)","v":-1000},{"$f":"IF(AND($A142<I$107,OR(I$108=10,$A142<>8,$A142<>9)), INDEX('Raw data'!$B$155:$AE$182,I$112,$A142+1)-I$110, -1000)","v":-1000},{"$f":"IF(AND($A142<J$107,OR(J$108=10,$A142<>8,$A142<>9)), INDEX('Raw data'!$B$155:$AE$182,J$112,$A142+1)-J$110, -1000)","v":-1000},0,0,0,0,0,0,0,0,0,0,0,0,0,0,{"$error":"#DIV/0!"},0,0,{"$error":"#DIV/0!"}]
[25,{"$f":"IF($B$114,'Raw data'!$D80,1)","v":0.2895787651471437},{"$f":"IF($B$114,'Raw data'!$D110,1)","v":0.1394},{"$f":"IF($B$114,'Raw data'!$D140,1)","v":7.1487179487179489E-2},{"$f":"IF(AND($A143<E$107,OR(E$108=10,$A143<>8,$A143<>9)), INDEX('Raw data'!$B$155:$AE$182,E$112,$A143+1)-E$110, -1000)","v":-1000},{"$f":"IF(AND($A143<F$107,OR(F$108=10,$A143<>8,$A143<>9)), INDEX('Raw data'!$B$155:$AE$182,F$112,$A143+1)-F$110, -1000)","v":-1000},{"$f":"IF(AND($A143<G$107,OR(G$108=10,$A143<>8,$A143<>9)), INDEX('Raw data'!$B$155:$AE$182,G$112,$A143+1)-G$110, -1000)","v":-1000},{"$f":"IF(AND($A143<H$107,OR(H$108=10,$A143<>8,$A143<>9)), INDEX('Raw data'!$B$155:$AE$182,H$112,$A143+1)-H$110, -1000)","v":-1000},{"$f":"IF(AND($A143<I$107,OR(I$108=10,$A143<>8,$A143<>9)), INDEX('Raw data'!$B$155:$AE$182,I$112,$A143+1)-I$110, -1000)","v":-1000},{"$f":"IF(AND($A143<J$107,OR(J$108=10,$A143<>8,$A143<>9)), INDEX('Raw data'!$B$155:$AE$182,J$112,$A143+1)-J$110, -1000)","v":-1000},0,0,0,0,0,0,0,0,0,0,0,0,0,0,{"$error":"#DIV/0!"},0,0,{"$error":"#DIV/0!"}]
[26,{"$f":"IF($B$114,'Raw data'!$D81,1)","v":0.25735384615384616},{"$f":"IF($B$114,'Raw data'!$D111,1)","v":0.12391111111111111},{"$f":"IF($B$114,'Raw data'!$D141,1)","v":6.3387646835922712E-2},{"$f":"IF(AND($A144<E$107,OR(E$108=10,$A144<>8,$A144<>9)), INDEX('Raw data'!$B$155:$AE$182,E$112,$A144+1)-E$110, -1000)","v":-1000},{"$f":"IF(AND($A144<F$107,OR(F$108=10,$A144<>8,$A144<>9)), INDEX('Raw data'!$B$155:$AE$182,F$112,$A144+1)-F$110, -1000)","v":-1000},{"$f":"IF(AND($A144<G$107,OR(G$108=10,$A144<>8,$A144<>9)), INDEX('Raw data'!$B$155:$AE$182,G$112,$A144+1)-G$110, -1000)","v":-1000},{"$f":"IF(AND($A144<H$107,OR(H$108=10,$A144<>8,$A144<>9)), INDEX('Raw data'!$B$155:$AE$182,H$112,$A144+1)-H$110, -1000)","v":-1000},{"$f":"IF(AND($A144<I$107,OR(I$108=10,$A144<>8,$A144<>9)), INDEX('Raw data'!$B$155:$AE$182,I$112,$A144+1)-I$110, -1000)","v":-1000},{"$f":"IF(AND($A144<J$107,OR(J$108=10,$A144<>8,$A144<>9)), INDEX('Raw data'!$B$155:$AE$182,J$112,$A144+1)-J$110, -1000)","v":-1000},0,0,0,0,0,0,0,0,0,0,0,0,0,0,{"$error":"#DIV/0!"},0,0,{"$error":"#DIV/0!"}]
[27,{"$f":"IF($B$114,'Raw data'!$D82,1)","v":0.23158283341024458},{"$f":"IF($B$114,'Raw data'!$D112,1)","v":0.11151999999999999},{"$f":"IF($B$114,'Raw data'!$D142,1)","v":5.7189743589743589E-2},{"$f":"IF(AND($A145<E$107,OR(E$108=10,$A145<>8,$A145<>9)), INDEX('Raw data'!$B$155:$AE$182,E$112,$A145+1)-E$110, -1000)","v":-1000},{"$f":"IF(AND($A145<F$107,OR(F$108=10,$A145<>8,$A145<>9)), INDEX('Raw data'!$B$155:$AE$182,F$112,$A145+1)-F$110, -1000)","v":-1000},{"$f":"IF(AND($A145<G$107,OR(G$108=10,$A145<>8,$A145<>9)), INDEX('Raw data'!$B$155:$AE$182,G$112,$A145+1)-G$110, -1000)","v":-1000},{"$f":"IF(AND($A145<H$107,OR(H$108=10,$A145<>8,$A145<>9)), INDEX('Raw data'!$B$155:$AE$182,H$112,$A145+1)-H$110, -1000)","v":-1000},{"$f":"IF(AND($A145<I$107,OR(I$108=10,$A145<>8,$A145<>9)), INDEX('Raw data'!$B$155:$AE$182,I$112,$A145+1)-I$110, -1000)","v":-1000},{"$f":"IF(AND($A145<J$107,OR(J$108=10,$A145<>8,$A145<>9)), INDEX('Raw data'!$B$155:$AE$182,J$112,$A145+1)-J$110, -1000)","v":-1000},0,0,0,0,0,0,0,0,0,0,0,0,0,0,{"$error":"#DIV/0!"},0,0,{"$error":"#DIV/0!"}]
[28,{"$f":"IF($B$114,'Raw data'!$D83,1)","v":0.21446153846153845},{"$f":"IF($B$114,'Raw data'!$D113,1)","v":0.10325925925925926},{"$f":"IF($B$114,'Raw data'!$D143,1)","v":4.7658119658119655E-2},{"$f":"IF(AND($A146<E$107,OR(E$108=10,$A146<>8,$A146<>9)), INDEX('Raw data'!$B$155:$AE$182,E$112,$A146+1)-E$110, -1000)","v":-1000},{"$f":"IF(AND($A146<F$107,OR(F$108=10,$A146<>8,$A146<>9)), INDEX('Raw data'!$B$155:$AE$182,F$112,$A146+1)-F$110, -1000)","v":-1000},{"$f":"IF(AND($A146<G$107,OR(G$108=10,$A146<>8,$A146<>9)), INDEX('Raw data'!$B$155:$AE$182,G$112,$A146+1)-G$110, -1000)","v":-1000},{"$f":"IF(AND($A146<H$107,OR(H$108=10,$A146<>8,$A146<>9)), INDEX('Raw data'!$B$155:$AE$182,H$112,$A146+1)-H$110, -1000)","v":-1000},{"$f":"IF(AND($A146<I$107,OR(I$108=10,$A146<>8,$A146<>9)), INDEX('Raw data'!$B$155:$AE$182,I$112,$A146+1)-I$110, -1000)","v":-1000},{"$f":"IF(AND($A146<J$107,OR(J$108=10,$A146<>8,$A146<>9)), INDEX('Raw data'!$B$155:$AE$182,J$112,$A146+1)-J$110, -1000)","v":-1000},0,0,0,0,0,0,0,0,0,0,0,0,0,0,{"$error":"#DIV/0!"},0,0,{"$error":"#DIV/0!"}]
[29,{"$f":"IF($B$114,'Raw data'!$D84,1)","v":{"$error":"#DIV/0!"}},{"$f":"IF($B$114,'Raw data'!$D114,1)","v":9.293333333333334E-2},{"$f":"IF($B$114,'Raw data'!$D144,1)","v":4.2892307692307695E-2},{"$f":"IF(AND($A147<E$107,OR(E$108=10,$A147<>8,$A147<>9)), INDEX('Raw data'!$B$155:$AE$182,E$112,$A147+1)-E$110, -1000)","v":-1000},{"$f":"IF(AND($A147<F$107,OR(F$108=10,$A147<>8,$A147<>9)), INDEX('Raw data'!$B$155:$AE$182,F$112,$A147+1)-F$110, -1000)","v":-1000},{"$f":"IF(AND($A147<G$107,OR(G$108=10,$A147<>8,$A147<>9)), INDEX('Raw data'!$B$155:$AE$182,G$112,$A147+1)-G$110, -1000)","v":-1000},{"$f":"IF(AND($A147<H$107,OR(H$108=10,$A147<>8,$A147<>9)), INDEX('Raw data'!$B$155:$AE$182,H$112,$A147+1)-H$110, -1000)","v":-1000},{"$f":"IF(AND($A147<I$107,OR(I$108=10,$A147<>8,$A147<>9)), INDEX('Raw data'!$B$155:$AE$182,I$112,$A147+1)-I$110, -1000)","v":-1000},{"$f":"IF(AND($A147<J$107,OR(J$108=10,$A147<>8,$A147<>9)), INDEX('Raw data'!$B$155:$AE$182,J$112,$A147+1)-J$110, -1000)","v":-1000},0,0,0,0,0,0,{"$f":"IF(K147<>0, (K147)*B147, 0)","v":0},{"$f":"IF(L147<>0, (L147)*C147, 0)","v":0},0,{"$f":"IF(N147<>0, (N147)*B147, 0)","v":0},{"$f":"IF(O147<>0, (O147)*C147, 0)","v":0},0,0,0,{"$error":"#DIV/0!"},0,0,{"$error":"#DIV/0!"}]
[null,null,null,null,null,null,null,null,"Sum",null,{"$f":"SUM(K118:K147)","v":6.0281807272537344},{"$f":"SUM(L118:L147)","v":6.0281807272537344},0,3.5637848380597998,3.5637848380597998,0,0.87763615789218419,0.5528265208947053,0,0.92198545175960778,0.80580069591415493,0,1,0.99999999999999978,{"$error":"#DIV/0!"},0.99999999999999989,1,{"$error":"#DIV/0!"}]
[null,null,null,null,null,null,null,"Avg",null,null,null,null,null,null,null,null,null,null,null,null,null,{"$f":"MMULT(W118:W147,'Raw data'!O55:O84)","v":{"$error":"#DIV/0!"}}]

{"sheet":"SLA QoS","index":6,"n_rows":157,"n_cols":19,"rows_kept":157,"cut":false,"hidden":false,"merged":[]}
[]
[null,"Outage target (50% for COMPETITIVE, 10% for DEPLOYMENT)",0.1]
[null,"Number of mesh hops (0=no mesh)",0,"hops"]
[]
[null,"Mode (DATA or QoS)"]
[]
[null," # data users (estimate, absolute for DATA-only, relative for QOS mode)",10]
[]
[null,"Default channel/environment"]
[]
[null,"HD only (unsupported)"]
[null,"Active client density",250,"sq.ft / user"]
[null,"Per-user throughput",1000,"kbps"]
[]
[null,"QOS Mode only (unsupported)"]
[null,"Voice codec"]
[]
[null," # voice users",1]
[null,"Video codec"]
[]
[null," # video users",0]
[]
[]
[null,"Air-time-fairness (ATF)"]
[]
[]
[]
[null,"HIDE BELOW"]
[null,"Per pkt OH",40,"bytes"]
[null,"PER Target",{"$f":"IF($C$32=1,0.1,0.01)","v":0.1}]
[]
[null,"Mode choice",1]
[null,"Num data users (capped)",{"$f":"MIN($C$7,200)","v":10}]
[null,"Data pkt. Size",{"$f":"1520+C33","v":1530}]
[null,"Total users",{"$f":"C33+C48+F48","v":11}]
[]
["Mode","Voice","Bytes/IP pkt","Period (ms)","Video",null,null,null,"Environment","PLE","ATF"]
["Data-only","G.711",160,20,"MPEG4",1520,20,null,"Outdoor LOS",2,"OFF (default)",1]
["QoS","G.729",20,20,"H.264/AVC",1520,20,null,"Outdoor suburban",3.85,"ON (Unsuported)",0]
[null,"G.723.1 (6.3kbps)",24,30,"WMA",1520,20,null,"Outdoor urban",3.85,1,{"$f":"INDEX(L38:L39,K40)","v":1}]
[null,"G.723.1 (5.3 kbps)",20,30,"QT",1520,20,null,"Indoor office",3.8]
[null,"G.726 (32kbps)",80,20,null,null,null,null,"Indoor cubes",3.6]
[null,"G.726 (24kbps)",60,20,null,null,null,null,"Indoor high-ceiling",3.3]
[null,"G.728 (16kbps)",60,30,null,null,null,null,4,{"$f":"INDEX(J38:J43,I44)","v":3.8}]
[null,"G.722 (64kbps)",160,20]
[null,"Codec choice",1,null,null,1]
[null,"Media bandwidth (full-duplex)",{"$f":"8*2*C49/(INDEX(D38:D48,C46)/1)","v":160},{"$f":"INDEX(D38:D45,C46)","v":20},null,{"$f":"8*2*F49/(INDEX(G38:G48,F46)/1)","v":1248},{"$f":"INDEX(G38:G41,F46)","v":20}]
[null,"Num users (capped)",{"$f":"MIN($C$18,200)","v":1},null,null,{"$f":"MIN($C$21,200)","v":0}]
[null,"IP pkt size",{"$f":"INDEX(C38:C49,C46)+C29","v":200},"bytes",null,{"$f":"INDEX(F38:F49,F46)+C29","v":1560},"bytes"]
[]
[]
["Outage target computation"]
[null,null,null,{"$f":"IF($C$30=0.1,1,2)","v":1},"Fade Margin (dB)",{"$f":"VLOOKUP(C2,B56:C106,2,TRUE)","v":7.8000000000000007},"PERs",0.01]
["Q(z)=erfc(z/sqrt(2))/2",null,"Std. dev",6,null,null,null,0.1]
["z = x/sigma, or margin/sigma","Q(z)","margin=z*s",null,"outage","margin (dB)",null,null,null,null,"z/sqrt2","t","erf(z/sqrt2)","erfc","erfc/2","compare"]
[2.5,{"$f":"ERFC(A56/SQRT(2))/2","v":6.2096653257761383E-3},{"$f":"A56*$D$54","v":15},null,0.01,{"$f":"VLOOKUP(E56,$B$56:$C$106,2,TRUE)","v":14.399999999999999},null,null,null,null,{"$f":"A56/SQRT(2)","v":1.7677669529663687},{"$f":"1/(1+$S$1*K56)","v":1},{"$f":"1-(#REF!*L56+$S$56*L56^2+$S$57*L56^3+$S$58*L56^4+$S$59*L56^5)*EXP(-(K56^2))","v":{"$error":"#REF!"}},{"$f":"1-M56","v":{"$error":"#REF!"}},{"$f":"N56/2","v":{"$error":"#REF!"}},{"$f":"O56/B56","v":{"$error":"#REF!"}},null,"a2",-0.28449673599999997]
[2.4,8.1975359245961381E-3,14.399999999999999,null,0.02,{"$f":"VLOOKUP(E57,$B$56:$C$106,2,TRUE)","v":12.600000000000001},null,null,null,null,{"$f":"A57/SQRT(2)","v":1.6970562748477138},{"$f":"1/(1+$S$1*K57)","v":1},{"$f":"1-(#REF!*L57+$S$56*L57^2+$S$57*L57^3+$S$58*L57^4+$S$59*L57^5)*EXP(-(K57^2))","v":{"$error":"#REF!"}},{"$f":"1-M57","v":{"$error":"#REF!"}},{"$f":"N57/2","v":{"$error":"#REF!"}},{"$f":"O57/B57","v":{"$error":"#REF!"}},null,"a3",1.4214137410000001]
[2.2999999999999998,1.0724110021675814E-2,13.799999999999999,null,0.03,11.399999999999999,null,null,null,null,1.626345596729059,1,{"$f":"1-(#REF!*L58+$S$56*L58^2+$S$57*L58^3+$S$58*L58^4+$S$59*L58^5)*EXP(-(K58^2))","v":{"$error":"#REF!"}},{"$error":"#REF!"},{"$error":"#REF!"},{"$error":"#REF!"},null,"a4",-1.453152027]
[2.2000000000000002,1.3903447513498609E-2,13.200000000000001,null,0.04,10.8,null,null,null,null,1.5556349186104046,1,{"$f":"1-(#REF!*L59+$S$56*L59^2+$S$57*L59^3+$S$58*L59^4+$S$59*L59^5)*EXP(-(K59^2))","v":{"$error":"#REF!"}},{"$error":"#REF!"},{"$error":"#REF!"},{"$error":"#REF!"},null,"a5",1.0614054289999999]
[2.1,1.7864420562816553E-2,12.600000000000001,null,0.05,10.199999999999999,null,null,null,null,1.4849242404917498,1,{"$f":"1-(#REF!*L60+$S$56*L60^2+$S$57*L60^3+$S$58*L60^4+$S$59*L60^5)*EXP(-(K60^2))","v":{"$error":"#REF!"}},{"$error":"#REF!"},{"$error":"#REF!"},{"$error":"#REF!"}]
[2,2.2750131948179219E-2,12,null,0.06,9.6000000000000014,null,null,null,null,1.4142135623730949,1,{"$f":"1-(#REF!*L61+$S$56*L61^2+$S$57*L61^3+$S$58*L61^4+$S$59*L61^5)*EXP(-(K61^2))","v":{"$error":"#REF!"}},{"$error":"#REF!"},{"$error":"#REF!"},{"$error":"#REF!"}]
[1.9,2.8716559816001824E-2,11.399999999999999,null,7.0000000000000007E-2,9,null,null,null,null,1.3435028842544401,1,{"$f":"1-(#REF!*L62+$S$56*L62^2+$S$57*L62^3+$S$58*L62^4+$S$59*L62^5)*EXP(-(K62^2))","v":{"$error":"#REF!"}},{"$error":"#REF!"},{"$error":"#REF!"},{"$error":"#REF!"}]
[1.8,3.593031911292581E-2,10.8,null,0.08,9,null,null,null,null,1.2727922061357855,1,{"$f":"1-(#REF!*L63+$S$56*L63^2+$S$57*L63^3+$S$58*L63^4+$S$59*L63^5)*EXP(-(K63^2))","v":{"$error":"#REF!"}},{"$error":"#REF!"},{"$error":"#REF!"},{"$error":"#REF!"}]
[1.7,4.4565462758543076E-2,10.199999999999999,null,0.09,8.3999999999999986,null,null,null,null,1.2020815280171306,1,{"$f":"1-(#REF!*L64+$S$56*L64^2+$S$57*L64^3+$S$58*L64^4+$S$59*L64^5)*EXP(-(K64^2))","v":{"$error":"#REF!"}},{"$error":"#REF!"},{"$error":"#REF!"},{"$error":"#REF!"}]
[1.6,5.4799291699558009E-2,9.6000000000000014,null,0.1,7.8000000000000007,null,null,null,null,1.131370849898476,1,{"$f":"1-(#REF!*L65+$S$56*L65^2+$S$57*L65^3+$S$58*L65^4+$S$59*L65^5)*EXP(-(K65^2))","v":{"$error":"#REF!"}},{"$error":"#REF!"},{"$error":"#REF!"},{"$error":"#REF!"}]
[1.5,6.6807201268858085E-2,9,null,0.11,7.8000000000000007,null,null,null,null,1.0606601717798212,1,{"$f":"1-(#REF!*L66+$S$56*L66^2+$S$57*L66^3+$S$58*L66^4+$S$59*L66^5)*EXP(-(K66^2))","v":{"$error":"#REF!"}},{"$error":"#REF!"},{"$error":"#REF!"},{"$error":"#REF!"}]
[1.4,8.0756659233771094E-2,8.3999999999999986,null,0.12,7.1999999999999993,null,null,null,null,0.98994949366116636,1,{"$f":"1-(#REF!*L67+$S$56*L67^2+$S$57*L67^3+$S$58*L67^4+$S$59*L67^5)*EXP(-(K67^2))","v":{"$error":"#REF!"}},{"$error":"#REF!"},{"$error":"#REF!"},{"$error":"#REF!"}]
[1.3,9.6800484585610344E-2,7.8000000000000007,null,0.13,7.1999999999999993,null,null,null,null,0.91923881554251174,1,{"$f":"1-(#REF!*L68+$S$56*L68^2+$S$57*L68^3+$S$58*L68^4+$S$59*L68^5)*EXP(-(K68^2))","v":{"$error":"#REF!"}},{"$error":"#REF!"},{"$error":"#REF!"},{"$error":"#REF!"}]
[1.2,0.1150696702217083,7.1999999999999993,null,0.14000000000000001,6.6000000000000005,null,null,null,null,0.84852813742385691,1,{"$f":"1-(#REF!*L69+$S$56*L69^2+$S$57*L69^3+$S$58*L69^4+$S$59*L69^5)*EXP(-(K69^2))","v":{"$error":"#REF!"}},{"$error":"#REF!"},{"$error":"#REF!"},{"$error":"#REF!"}]
[1.1000000000000001,0.13566606094638264,6.6000000000000005,null,0.15,6.6000000000000005,null,null,null,null,0.7778174593052023,1,{"$f":"1-(#REF!*L70+$S$56*L70^2+$S$57*L70^3+$S$58*L70^4+$S$59*L70^5)*EXP(-(K70^2))","v":{"$error":"#REF!"}},{"$error":"#REF!"},{"$error":"#REF!"},{"$error":"#REF!"}]
[1,0.15865525393145713,6,null,0.16,6,null,null,null,null,0.70710678118654746,1,{"$f":"1-(#REF!*L71+$S$56*L71^2+$S$57*L71^3+$S$58*L71^4+$S$59*L71^5)*EXP(-(K71^2))","v":{"$error":"#REF!"}},{"$error":"#REF!"},{"$error":"#REF!"},{"$error":"#REF!"}]
[0.9,0.1840601253467595,5.4,null,0.17,6,null,null,null,null,0.63639610306789274,1,{"$f":"1-(#REF!*L72+$S$56*L72^2+$S$57*L72^3+$S$58*L72^4+$S$59*L72^5)*EXP(-(K72^2))","v":{"$error":"#REF!"}},{"$error":"#REF!"},{"$error":"#REF!"},{"$error":"#REF!"}]
[0.8,0.21185539858339666,4.8000000000000007,null,0.18,6,null,null,null,null,0.56568542494923801,1,{"$f":"1-(#REF!*L73+$S$56*L73^2+$S$57*L73^3+$S$58*L73^4+$S$59*L73^5)*EXP(-(K73^2))","v":{"$error":"#REF!"}},{"$error":"#REF!"},{"$error":"#REF!"},{"$error":"#REF!"}]
[0.7,0.24196365222307303,4.1999999999999993,null,0.19,5.4,null,null,null,null,0.49497474683058318,1,{"$f":"1-(#REF!*L74+$S$56*L74^2+$S$57*L74^3+$S$58*L74^4+$S$59*L74^5)*EXP(-(K74^2))","v":{"$error":"#REF!"}},{"$error":"#REF!"},{"$error":"#REF!"},{"$error":"#REF!"}]
[0.6,0.27425311775007361,3.5999999999999996,null,0.2,5.4,null,null,null,null,0.42426406871192845,1,{"$f":"1-(#REF!*L75+$S$56*L75^2+$S$57*L75^3+$S$58*L75^4+$S$59*L75^5)*EXP(-(K75^2))","v":{"$error":"#REF!"}},{"$error":"#REF!"},{"$error":"#REF!"},{"$error":"#REF!"}]
[0.5,0.30853753872598688,3,null,0.21,5.4,null,null,null,null,0.35355339059327373,1,{"$f":"1-(#REF!*L76+$S$56*L76^2+$S$57*L76^3+$S$58*L76^4+$S$59*L76^5)*EXP(-(K76^2))","v":{"$error":"#REF!"}},{"$error":"#REF!"},{"$error":"#REF!"},{"$error":"#REF!"}]
[0.4,0.34457825838967582,2.4000000000000004,null,0.22,4.8000000000000007,null,null,null,null,0.28284271247461901,1,{"$f":"1-(#REF!*L77+$S$56*L77^2+$S$57*L77^3+$S$58*L77^4+$S$59*L77^5)*EXP(-(K77^2))","v":{"$error":"#REF!"}},{"$error":"#REF!"},{"$error":"#REF!"},{"$error":"#REF!"}]
[0.3,0.38208857781104738,1.7999999999999998,null,0.23,4.8000000000000007,null,null,null,null,0.21213203435596423,1,{"$f":"1-(#REF!*L78+$S$56*L78^2+$S$57*L78^3+$S$58*L78^4+$S$59*L78^5)*EXP(-(K78^2))","v":{"$error":"#REF!"}},{"$error":"#REF!"},{"$error":"#REF!"},{"$error":"#REF!"}]
[0.2,0.42074029056089696,1.2000000000000002,null,0.24,4.8000000000000007,null,null,null,null,0.1414213562373095,1,{"$f":"1-(#REF!*L79+$S$56*L79^2+$S$57*L79^3+$S$58*L79^4+$S$59*L79^5)*EXP(-(K79^2))","v":{"$error":"#REF!"}},{"$error":"#REF!"},{"$error":"#REF!"},{"$error":"#REF!"}]
[0.1,0.46017216272297101,0.60000000000000009,null,0.25,4.1999999999999993,null,null,null,null,7.0710678118654752E-2,1,{"$f":"1-(#REF!*L80+$S$56*L80^2+$S$57*L80^3+$S$58*L80^4+$S$59*L80^5)*EXP(-(K80^2))","v":{"$error":"#REF!"}},{"$error":"#REF!"},{"$error":"#REF!"},{"$error":"#REF!"}]
[0,0.5,0,null,0.26,4.1999999999999993,null,null,null,null,0,1,{"$f":"1-(#REF!*L81+$S$56*L81^2+$S$57*L81^3+$S$58*L81^4+$S$59*L81^5)*EXP(-(K81^2))","v":{"$error":"#REF!"}},{"$error":"#REF!"},{"$error":"#REF!"},{"$error":"#REF!"}]
[-0.1,0.53982783727702899,-0.60000000000000009,null,0.27,4.1999999999999993]
[-0.2,0.57925970943910299,-1.2000000000000002,null,0.28000000000000003,3.5999999999999996]
[-0.3,0.61791142218895256,-1.7999999999999998,null,0.28999999999999998,3.5999999999999996]
[-0.4,0.65542174161032418,-2.4000000000000004,null,0.3,3.5999999999999996]
[-0.5,0.69146246127401312,-3,null,0.31,3]
[-0.6,0.72574688224992645,-3.5999999999999996,null,0.32,3]
[-0.7,0.75803634777692697,-4.1999999999999993,null,0.33,3]
[-0.8,0.78814460141660336,-4.8000000000000007,null,0.34,3]
[-0.9,0.81593987465324047,-5.4,null,0.35,2.4000000000000004]
[-1,0.84134474606854281,-6,null,0.36,2.4000000000000004]
[-1.1000000000000001,0.86433393905361733,-6.6000000000000005,null,0.37,2.4000000000000004]
[-1.2,0.88493032977829167,-7.1999999999999993,null,0.38,2.4000000000000004]
[-1.3,0.9031995154143897,-7.8000000000000007,null,0.39,1.7999999999999998]
[-1.4,0.91924334076622893,-8.3999999999999986,null,0.4,1.7999999999999998]
[-1.5,0.93319279873114191,-9,null,0.41,1.7999999999999998]
[-1.6,0.94520070830044201,-9.6000000000000014,null,0.42,1.7999999999999998]
[-1.7,0.95543453724145688,-10.199999999999999,null,0.43,1.2000000000000002]
[-1.8,0.96406968088707423,-10.8,null,0.44,1.2000000000000002]
[-1.9,0.97128344018399815,-11.399999999999999,null,0.45,1.2000000000000002]
[-2,0.97724986805182079,-12,null,0.46,1.2000000000000002]
[-2.1,0.98213557943718344,-12.600000000000001,null,0.47,0.60000000000000009]
[-2.2000000000000002,0.98609655248650141,-13.200000000000001,null,0.48,0.60000000000000009]
[-2.2999999999999998,0.98927588997832416,-13.799999999999999,null,0.49,0.60000000000000009]
[-2.4,0.99180246407540384,-14.399999999999999,null,0.5,0]
[-2.5,0.99379033467422384,-15,null,0.51,0]
[null,null,null,null,0.52,0]
[null,null,null,null,0.53,0]
[null,null,null,null,0.54,-0.60000000000000009]
[null,null,null,null,0.55000000000000004,-0.60000000000000009]
[null,null,null,null,0.56000000000000005,-0.60000000000000009]
[null,null,null,null,0.56999999999999995,-0.60000000000000009]
[null,null,null,null,0.57999999999999996,-1.2000000000000002]
[null,null,null,null,0.59,-1.2000000000000002]
[null,null,null,null,0.6,-1.2000000000000002]
[null,null,null,null,0.61,-1.2000000000000002]
[null,null,null,null,0.62,-1.7999999999999998]
[null,null,null,null,0.63,-1.7999999999999998]
[null,null,null,null,0.64,-1.7999999999999998]
[null,null,null,null,0.65,-1.7999999999999998]
[null,null,null,null,0.66,{"$f":"VLOOKUP(E121,$B$56:$C$106,2,TRUE)","v":-2.4000000000000004}]
[null,null,null,null,0.67,-2.4000000000000004]
[null,null,null,null,0.68,-2.4000000000000004]
[null,null,null,null,0.69,-2.4000000000000004]
[null,null,null,null,0.7,-3]
[null,null,null,null,0.71,-3]
[null,null,null,null,0.72,-3]
[null,null,null,null,0.73,-3.5999999999999996]
[null,null,null,null,0.74,-3.5999999999999996]
[null,null,null,null,0.75,-3.5999999999999996]
[null,null,null,null,0.76,-4.1999999999999993]
[null,null,null,null,0.77,-4.1999999999999993]
[null,null,null,null,0.78,-4.1999999999999993]
[null,null,null,null,0.79,-4.8000000000000007]
[null,null,null,null,0.8,-4.8000000000000007]
[null,null,null,null,0.81,-4.8000000000000007]
[null,null,null,null,0.82,-5.4]
[null,null,null,null,0.83,-5.4]
[null,null,null,null,0.84,-5.4]
[null,null,null,null,0.85,-6]
[null,null,null,null,0.86,-6]
[null,null,null,null,0.87,-6.6000000000000005]
[null,null,null,null,0.88,-6.6000000000000005]
[null,null,null,null,0.89,-7.1999999999999993]
[null,null,null,null,0.9,-7.1999999999999993]
[null,null,null,null,0.91,-7.8000000000000007]
[null,null,null,null,0.92,-8.3999999999999986]
[null,null,null,null,0.93,-8.3999999999999986]
[null,null,null,null,0.94,-9]
[null,null,null,null,0.95,-9.6000000000000014]
[null,null,null,null,0.96,-10.199999999999999]
[null,null,null,null,0.97,-10.8]
[null,null,null,null,0.98,-12]
[null,null,null,null,0.99,-13.799999999999999]
[null,null,null,null,1,-15]
[]
[null,null,null,null,null,null,"Max 200"]

{"sheet":"Client_Access_&_Mesh","index":7,"n_rows":192,"n_cols":38,"rows_kept":192,"cut":false,"hidden":true,"merged":[[7,16,7,18],[7,19,7,21],[2,2,2,4],[2,13,2,15],[7,2,7,4],[7,5,7,7],[7,8,7,10],[7,13,7,15]]}
[" ",null,null,null,null,null,null,"Legend:",null,"Input"]
[null,null,null,null,null,null,null,null,null,"Result"]
[null,null,"Site 1 (AP)",null,null,null,null,null,null,"Actual",null,null,null,"Site 2 (client/MAP)"]
[]
["Regulatory Domain (EIRP) ----------------------------->",null,null,null,null,null,null,null,null,null,null,null,null,null,null,null,null,null,null,null,null," ",null,null," "]
[null,"Actual",null,{"$f":"C85","v":36},"dBm",null,null,{"$f":"D85","v":35},"dBm"]
[]
[null,null,"Radio 1: 2.4GHz(20MHz)",null,null,"Radio 2: 5GHz (20 or 40MHz)",null,null,"Radio 3: 5GHz (20, 40 or 80MHz .ac)",null,null,null,null,"Radio 1: 2.4GHz(20MHz)",null,null,"Radio 2: 5GHz (20 or 40MHz)",null,null,"Radio 3: 5GHz (20, 40 or 80MHz .ac)"]
[]
["Select Device---------------------------------->"]
["Note: When choosing antennas and power levels, EIRP cannot exceed the regulatory power limit"]
[]
["Desired Data Rate--------------------------------->"]
[]
[null,"Actual",null,{"$f":"$C$138","v":6.5},"Mbps",null,{"$f":"$E$138","v":13.5},"Mbps",null,{"$f":"$G$138","v":0},"Mbps"]
[]
["Select Antenna Here------------------------->",null,null,null," "]
["    For other Antenna-Enter Gain Here---------->",null,null,-1,"dBi",null,-1,"dBi",null,-1,"dBi",null,null,null,-1,"dBi",null,-1,"dBi",null,-1,"dBi"]
[]
[null,"Actual",null,{"$f":"$Q$83","v":2},"dBi",null,{"$f":"$S$83","v":5},"dBi",null,{"$f":"$U$83","v":5},"dBi",null,null,null,{"$f":"$Q$97","v":-1.4},"dBi",null,{"$f":"$S$97","v":-2.9},"dBi",null,{"$f":"$U$97","v":0},"dBi"]
[]
["Enter Antenna Height Here (outdoor-only) --------------->",null,null,4,"(meters)",null,null,null,null,null,null,null,null,null,2,"(meters)"]
[]
[]
["Select Channel-------------------------------------->"]
[]
[]
["Select Conducted Power Level in dBm--------->"]
["    For other TXP-Enter total here---------->",null,null,-1,"dBm",null,-1,"dBm",null,-1,"dBm",null,null,null,-1,"dBm",null,-1,"dBm",null,-1,"dBm"]
[]
[null,"Actual",null,{"$f":"X84","v":23},"dBm",null,{"$f":"Y84","v":16.979400086720375},"dBm",null,{"$f":"Z84","v":16.979400086720375},"dBm",null,null,null,{"$f":"X99","v":16},"dBm",null,{"$f":"Y99","v":13},"dBm",null,{"$f":"Z99","v":0},"dBm"]
[]
["Select Cable --------------------------------------->",null," "]
["           Enter Loss in dB Here for \"Other Cable\"-------------->",null,null,-1,"dB",null,-1,"dB",null,-1,"dB",null,null,null,-1,"dB",null,-1,"dB",null,-1,"dB"]
["Note: Cable selection only used when \"Other Antenna\" is selected above"]
[null,"Actual",null,{"$f":"AC83","v":0},"dB",null,{"$f":"AD83","v":0},"dB",null,{"$f":"AE83","v":0},"dB",null,null,null,{"$f":"AC97","v":0},"dB",null,{"$f":"AD97","v":0},"dB",null,{"$f":"AE97","v":0},"dB"]
[]
["Effective Isotropic Radiated Power = EIRP ---------->",null,null,{"$f":"C125","v":25},"dBm",null,{"$f":"E125","v":21.979400086720375},"dBm",null,{"$f":"G125","v":21.979400086720375},"dBm",null,null,null,{"$f":"D125","v":14.6},"dBm",null,{"$f":"F125","v":10.1},"dBm",null,{"$f":"H125","v":0},"dBm"]
[null,null,null,null,{"$f":"IF($C$126=1,$B$181,\" \")","v":" "}]
[null,null,null,null,null,null,null,{"$f":"IF($E$126=1,$B$181,\" \")","v":" "},null,null,{"$f":"IF($G$126=1,$B$181,\" \")","v":" "}]
[null,null,null,null,null,null,null,null,null,null,null,null,null,null,null,{"$f":"IF($D$126=1,$B$181,\" \")","v":" "}]
[null,null,null,"2.4GHz",null,null,"5GHz",null,null,"5GHz",null,null,null,null,"2.4Ghz",null,null,"5GHz",{"$f":"IF($F$126=1,$B$181,\" \")","v":" "},null,"5GHz",{"$f":"IF($F$126=1,$B$181,\" \")","v":" "}]
["Resultant RSSI ->",null,null,"Site 1 -> Site 2",null,null,"Site 1 -> Site 2",null,null,"Site 1 -> Site 2",null,null,null,null,"Site 2 -> Site 1",null,null,"Site 2 -> Site 1",null,null,"Site 2 -> Site 1"]
[null,null,null,{"$f":"$C$132","v":-80.789700043360199},"dBm",null,{"$f":"$E$132","v":-77.779400086720386},"dBm",null,{"$f":"$G$132","v":928.01029995663987},"dBm",null,null,null,{"$f":"$D$132","v":-87.789700043360199},"dBm",null,{"$f":"$F$132","v":-81.758800173440761},"dBm",null,{"$f":"$H$132","v":911.03089986991949},"dBm"]
[]
[null,null,null,"2.4GHz",null,null,"5GHz",null,null,"5GHz",null,null,null,null,"2.4Ghz",null,null,"5GHz",{"$f":"IF($F$126=1,$B$181,\" \")","v":" "},null,"5GHz"]
[null,null,null,"Site 1 <-> Site 2",null,null,"Site 1 <-> Site 2",null,null,"Site 1 <-> Site 2",null,null,null,null,"Site 1 <-> Site 2",null,null,"Site 1 <-> Site 2",null,null,"Site 1 <-> Site 2"]
["Range ->","Indoor (drywall office)",null,{"$f":"IF(($C$126+$D$126)>0,0,$C164)","v":30.846268368990977},"meters",null,{"$f":"IF(($E$126+$F$126)>0,0,$D164)","v":12.788232717829018},"meters",null,{"$f":"IF(($G$126+$H$126)>0,0,$E164)","v":5.1877175107596816E-26},"meters",null,null,"Area ->",{"$f":"(D48)^2*PI()","v":2989.2011325794197},"m^2",null,{"$f":"(G48)^2*PI()","v":513.77259439226452},"m^2",null,{"$f":"(J48)^2*PI()","v":8.454783888145881E-51},"m^2"]
[null,"Indoor (cubes walled office)",null,{"$f":"IF(($C$126+$D$126)>0,0,$C165)","v":37.319525418672633},"meters",null,{"$f":"IF(($E$126+$F$126)>0,0,$D165)","v":14.733299075762316},"meters",null,{"$f":"IF(($G$126+$H$126)>0,0,$E165)","v":2.0429266855140158E-27},"meters",null,null,null,{"$f":"(D49)^2*PI()","v":4375.4436727447001},"m^2",null,{"$f":"(G49)^2*PI()","v":681.94583667603536},"m^2",null,{"$f":"(J49)^2*PI()","v":1.311159226759138E-53},"m^2"]
[null,"Indoor (high-ceiling / HD)",null,{"$f":"IF(($C$126+$D$126)>0,0,$C166)","v":51.860821898248538},"meters",null,{"$f":"IF(($E$126+$F$126)>0,0,$D166)","v":18.815211136889658},"meters",null,{"$f":"IF(($G$126+$H$126)>0,0,$E166)","v":7.6544171229280675E-30},"meters",null,null,null,8449.4543358572409,"m^2",null,1112.1620329483942,"m^2",null,1.8406623241963879E-58,"m^2"]
[]
[null,"Outdoor (LOS Fresnel free)",null,{"$f":"IF(($C$126+$D$126)>0,0,$C143)","v":244.42243145903521},"meters",null,{"$f":"IF(($E$126+$F$126)>0,0,$D143)","v":53.341922855998355},"meters",null,{"$f":"IF(($G$126+$H$126)>0,0,$E143)","v":1.384118299315151E-44},"meters",null,null,null,"Note: 10 sq. ft = 1 m^2"]
[null,"Outdoor NLOS Suburban",null,{"$f":"IF(($C$126+$D$126)>0,0,$C158)","v":46.922317496825649},"meters",null,{"$f":"IF(($E$126+$F$126)>0,0,$D158)","v":16.929572362071017},"meters",null,{"$f":"IF(($G$126+$H$126)>0,0,$E158)","v":5.5200882375270584E-24},"meters",null,null,null," "]
[null,"Outdoor NLOS Dense Urban",null,{"$f":"IF(($C$126+$D$126)>0,0,$C159)","v":38.502256122617901},"meters",null,{"$f":"IF(($E$126+$F$126)>0,0,$D159)","v":13.73319802796029},"meters",null,{"$f":"IF(($G$126+$H$126)>0,0,$E159)","v":4.4778724043623218E-24},"meters"]
[]
[null,null,null,"Note: Lowest RSSI of site1->2 & site2->1 used for RANGE and AREA estimation - see RSSI for limit"]
[null,null,null," "]
[null,null,null,"Avg",null,null,"Avg",null,null,"Avg"]
["Location->","Indoor (drywall office)",null,{"$f":"IF(($C$126+$D$126)>0,0,$C170)","v":17.539035207375701},"meters",null,{"$f":"IF(($E$126+$F$126)>0,0,$D170)","v":7.1358008687412973},"meters",null,{"$f":"IF(($G$126+$H$126)>0,0,$E170)","v":-0.23150000000000001},"meters"]
["accuracy*","Indoor (cubes walled office)",null,{"$f":"IF(($C$126+$D$126)>0,0,$C171)","v":21.2682785936973},"meters",null,{"$f":"IF(($E$126+$F$126)>0,0,$D171)","v":8.2563535975466689},"meters",null,{"$f":"IF(($G$126+$H$126)>0,0,$E171)","v":-0.23150000000000001},"meters"]
[null,"Indoor (high-ceiling)",null,{"$f":"IF(($C$126+$D$126)>0,0,$C172)","v":17.546234899518932},"meters",null,{"$f":"IF(($E$126+$F$126)>0,0,$D172)","v":9.790430053828004},"meters",null,{"$f":"IF(($G$126+$H$126)>0,0,$E172)","v":5.3745000000000003},"meters"]
[]
[null,null,null,"90%-ile",null,null,"90%-ile",null,null,"90%-ile"]
[null,"Indoor (drywall office)",null,{"$f":"IF(($C$126+$D$126)>0,0,$C176)","v":30.6941077696167},"meters",null,{"$f":"IF(($E$126+$F$126)>0,0,$D176)","v":12.487996226115214},"meters",null,{"$f":"IF(($G$126+$H$126)>0,0,$E176)","v":-0.40510000000000002},"meters"]
[null,"Indoor (cubes walled office)",null,{"$f":"IF(($C$126+$D$126)>0,0,$C177)","v":37.220445527105753},"meters",null,{"$f":"IF(($E$126+$F$126)>0,0,$D177)","v":14.449012128183568},"meters",null,{"$f":"IF(($G$126+$H$126)>0,0,$E177)","v":-0.40510000000000002},"meters"]
[null,"Indoor (high-ceiling)",null,{"$f":"IF(($C$126+$D$126)>0,0,$C178)","v":30.709525635800496},"meters",null,{"$f":"IF(($E$126+$F$126)>0,0,$D178)","v":17.134388735034271},"meters",null,{"$f":"IF(($G$126+$H$126)>0,0,$E178)","v":9.4050999999999991},"meters"]
["* assumes even AP density with >= 4 APs"]
[]
[]
["Country and Regulatory Domain Selection",null,null,null,null,null,null,null,null,null,null,"Device & MCS selection",null,null,null,"Antenna Selection",null,null,null,null,null,null,"Conducted Power Selection",null,null,null,null,"Cable Selection",null,null,null,null,"Channel Selection & TXP limit"]
[null," "," "," "," "," ",null,null,null,null,null,"Site 1",null,null,null,"Site 1",null,null,null,null,null,null,"Site 1",null,null,null,null,"Site 1",null,null,null,null,"Site 1"]
["Country List"," Model","EIRP [band 1]","EIRP [band 2]","Band 1-1","Band 2-1","Band 2-2","Band 2-3","Band 2-4",null,null,"Radio 1","Radio 2","Radio 3",null,"Radio 1","Radio 1","Radio 2","Radio 2 ","Radio 3","Radio 3",null,null,"Radio 1","Radio 2","Radio 3",null,null,"Radio 1","Radio 2","Radio 3",null,"Radio 1","Radio 1","Radio 2","Radio 2","Radio 3","Radio 3"]
["A (America FCC)","AIR-LAPxxxxx-A-K9",36,35,"2.40-2.4835GHz (11 chans)","5.15-5.25GHz (UNII-1) [indoor]","5.25-5.35GHz (UNII-2) [indoor]","5.47-5.725GHz (UNII-2 Ext) [indoor]","5.725-5825GHz (UNII-3)",null,"Choice",1,{"$f":"L73","v":1},{"$f":"L73","v":1},null,"Antenna","Gain (dBi)","Antenna","Gain (dB)","Antenna","Gain (dB)",null,"Level","Power (dBm)","Power (dBm)","Power (dBm)",null,"Cable","Loss (dB)","Loss (dB)","Loss (dB)",null,"Channel range","TXP","Channel range","TXP","Channel range","TXP"]
["C (China)","AIR-LAPxxxxx-C-K9",20,30,"2.40-2.4835GHz (11 chans)","5.15-5.850GHz","N/A","N/A","N/A",null,"# SS",{"$f":"INDEX('Raw data'!B$187:B$199,'Client_Access_&_Mesh'!$L$73)","v":3},{"$f":"INDEX('Raw data'!C$187:C$199,'Client_Access_&_Mesh'!$L$73)","v":3},{"$f":"INDEX('Raw data'!D$187:D$199,'Client_Access_&_Mesh'!$L$73)","v":3},null,{"$f":"INDEX(P125:AB125,L$73)","v":"Integrated"},{"$f":"INDEX(P116:AB116,L$73)","v":2},{"$f":"INDEX(P155:AB155,M$73)","v":"Integrated"},{"$f":"INDEX(P146:AB146,M$73)","v":5},{"$f":"INDEX(P185:AB185,N$73)","v":"Integrated"},{"$f":"INDEX(P176:AB176,N$73)","v":5},null,"PL1",{"$f":"INDEX(P106:AB106,L$73)","v":23},{"$f":"INDEX(P136:AB136,M$73)","v":23},{"$f":"INDEX(P166:AB166,N$73)","v":23},null,"150ft ULTRA LOW loss",6.6,6.6,6.6,null,{"$f":"INDEX(E73:E84,$B$85)","v":"2.40-2.4835GHz (11 chans)"},{"$f":"INDEX(E90:E101,$B$85)","v":30},{"$f":"INDEX(F73:F84,B85)","v":"5.15-5.25GHz (UNII-1) [indoor]"},{"$f":"INDEX(F90:F101,$B$85)","v":9.9794000867203749},{"$f":"INDEX(F73:F84,$B$85)","v":"5.15-5.25GHz (UNII-1) [indoor]"},{"$f":"INDEX(F90:F101,$B$85)","v":9.9794000867203749}]
["D (India)","AIR-LAPxxxxx-D-K9",20,30,"2.40-2.4835GHz (11 chans)","5.15-5.850GHz","N/A","N/A","N/A",null,"# MCS",{"$f":"INDEX('Raw data'!E$187:E$199,'Client_Access_&_Mesh'!$L$73)","v":8},{"$f":"INDEX('Raw data'!F$187:F$199,'Client_Access_&_Mesh'!$M$73)","v":8},{"$f":"INDEX('Raw data'!G$187:G$199,'Client_Access_&_Mesh'!$N$73)","v":10},null,"AIR-ANT2524Dx-R (dipole)",2,"AIR-ANT2524Dx-R (dipole)",4,"N/A",0,null,"PL2",20,20,20,null,"100ft ULTRA LOW loss",4.4000000000000004,4.4000000000000004,4.4000000000000004,null,"N/A","N/A",{"$f":"INDEX(G73:G84,B85)","v":"5.25-5.35GHz (UNII-2) [indoor]"},{"$f":"INDEX(G90:G101,$B$85)","v":16.979400086720375},{"$f":"INDEX(G73:G84,$B$85)","v":"5.25-5.35GHz (UNII-2) [indoor]"},{"$f":"INDEX(G90:G101,$B$85)","v":16.979400086720375}]
["E (Europe/ ETSI)","AIR-LAPxxxxx-E-K9",20,30,"2.40-2.4835GHz (11 chans)","5.15-5.250GHz","5.25-5.35GHz","5.47-5.725GHz","N/A",null,"# BF",{"$f":"INDEX('Raw data'!H$187:H$199,'Client_Access_&_Mesh'!$L$73)","v":4},{"$f":"INDEX('Raw data'!I$187:I$199,'Client_Access_&_Mesh'!$L$73)","v":4},{"$f":"INDEX('Raw data'!J$187:J$199,'Client_Access_&_Mesh'!$L$73)","v":3},null,"AIR-ANT2524V4C-R (ceiling)",2,"AIR-ANT2524V4C-R (ceiling)",4,"N/A",0,null,"PL3",17,17,17,null,"100Ft standard cable",6.8,6.8,6.8,null,"N/A","N/A",{"$f":"INDEX(H73:H84,B85)","v":"5.47-5.725GHz (UNII-2 Ext) [indoor]"},{"$f":"INDEX(H90:H101,$B$85)","v":16.979400086720375},{"$f":"INDEX(H73:H84,$B$85)","v":"5.47-5.725GHz (UNII-2 Ext) [indoor]"},{"$f":"INDEX(H90:H101,$B$85)","v":16.979400086720375}]
["K (Korea)","AIR-LAPxxxxx-K-K9",29,28,"2.40-2.4835GHz (11 chans)","5.15-5.850GHz","N/A","N/A","N/A",null,"# TX",{"$f":"INDEX('Raw data'!K$187:K$199,'Client_Access_&_Mesh'!$L$73)","v":4},{"$f":"INDEX('Raw data'!L$187:L$199,'Client_Access_&_Mesh'!$L$73)","v":4},{"$f":"INDEX('Raw data'!M$187:M$199,'Client_Access_&_Mesh'!$L$73)","v":3},null,"AIR-ANT2544V4M-R (wall)",4,"AIR-ANT2544V4M-R (wall)",4,"N/A",0,null,"PL4",14,14,14,null,"75Ft standard cable",5.0999999999999996,5.0999999999999996,5.0999999999999996,null,"N/A","N/A",{"$f":"INDEX(I73:I84,B85)","v":"5.725-5825GHz (UNII-3)"},{"$f":"INDEX(I90:I101,$B$85)","v":29},{"$f":"INDEX(I73:I84,$B$85)","v":"5.725-5825GHz (UNII-3)"},{"$f":"INDEX(I90:I101,$B$85)","v":29}]
["M (Middle East)","AIR-LAPxxxxx-M-K9",20,30,"2.40-2.4835GHz (11 chans)","5.15-5.850GHz","N/A","N/A","N/A",null,"# RX",{"$f":"INDEX('Raw data'!N$187:N$199,'Client_Access_&_Mesh'!$L$73)","v":4},{"$f":"INDEX('Raw data'!O$187:O$199,'Client_Access_&_Mesh'!$L$73)","v":4},{"$f":"INDEX('Raw data'!P$187:P$199,'Client_Access_&_Mesh'!$L$73)","v":3},null,"AIR-ANT2566P4W-R (patch)",6,"AIR-ANT2566P4W-R (patch)",6,"N/A",0,null,"PL5",11,11,11,null,"50Ft standard cable",3.4,3.4,3.4,null,"Chan choice:",1,null,2,null,{"$f":"AJ78","v":2}]
["N (Mexico, Brazil, Fiji, HK, Barbados, Dominican, Panama)","AIR-LAPxxxxx-N-K9",35,36,"2.40-2.4835GHz (11 chans)","5.15-5.850GHz","N/A","N/A","N/A",null,"NF",{"$f":"INDEX('Raw data'!Q$187:Q$199,'Client_Access_&_Mesh'!$L$73)","v":6},{"$f":"INDEX('Raw data'!R$187:R$199,'Client_Access_&_Mesh'!$L$73)","v":6},{"$f":"INDEX('Raw data'!S$187:S$199,'Client_Access_&_Mesh'!$L$73)","v":6},null,"N/A",0,"N/A",0,"N/A",0,null,"PL6",8,8,8,null,"20Ft standard cable",1.3,1.3,1.3,null,"TXP Limit",{"$f":"INDEX(AH74:AH77,AH78)","v":30},null,{"$f":"INDEX(AJ74:AJ77,AJ78)","v":16.979400086720375},null,{"$f":"INDEX(AL74:AL77,AL78)","v":16.979400086720375}]
["Q (Japan)","AIR-LAPxxxxx-Q-K9",25,26,"2.40-2.4835GHz (11 chans)","5.15-5.850GHz","N/A","N/A","N/A",null,null,null,null,null,null,"N/A",0,"N/A",0,"N/A",0,null,"PL7",5,5,5,null,"NO Cable",0,0,0]
["R (Russia)","AIR-LAPxxxxx-R-K9",25,38,"2.40-2.4835GHz (11 chans)","5.15-5.850GHz","N/A","N/A","N/A",null,null,"Site 2",null,null,null,"Other: Enter Gain Below",{"$f":"D18","v":-1},"Other: Enter Gain Below",{"$f":"G18","v":-1},"Other: Enter Gain Below",{"$f":"J18","v":-1},null,"PL8",2,2,2,null,"Other: enter loss below",{"$f":"D34","v":-1},{"$f":"G34","v":-1},{"$f":"J34","v":-1},null,"Freq in GHz",2.4,null,5,null,5]
["S (Singapore/Brunei)","AIR-LAPxxxxx-S-K9",20,30,"2.40-2.4835GHz (11 chans)","5.15-5.850GHz","N/A","N/A","N/A",null,null,"Radio 1","Radio 2","Radio 3",null,"Ant choice",1,null,1,null,1,null,"Other: enter TXP",{"$f":"D29","v":-1},{"$f":"G29","v":-1},{"$f":"J29","v":-1},null,"Cable Choice:",7,7,7,null,"kTB",{"$f":"-(-174+10*LOG10(L92*1000000))","v":100.98970004336019},null,{"$f":"-(-174+10*LOG10(M92*1000000))","v":97.979400086720375},null,{"$f":"-(-174+10*LOG10(N92*1000000))","v":94.969100130080562}]
["T (Taiwan)","AIR-LAPxxxxx-T-K10",35,36,"2.40-2.4835GHz (11 chans)","5.15-5.850GHz","N/A","N/A","N/A",null,"Choice",9,{"$f":"L83","v":9},{"$f":"L83","v":9},null,"Actual dBi",{"$f":"IF(Q82<>8,INDEX(Q74:Q81,Q82),Q81)","v":2},null,{"$f":"IF(S82<>8,INDEX(S74:S81,S82),S81)","v":5},null,{"$f":"IF(U82<>8,INDEX(U74:U81,U82),U81)","v":5},null,"PL Choice:",1,1,1,null,"Cable value",{"$f":"IF(AC82<>8,INDEX(AC74:AC81,AC82),AC81)","v":0},{"$f":"IF(AD82<>8,INDEX(AD74:AD81,AD82),AD81)","v":0},0,null,"NF",{"$f":"INDEX('Raw data'!Q187:Q199,'Client_Access_&_Mesh'!AH84)","v":6},null,{"$f":"INDEX('Raw data'!R187:R199,'Client_Access_&_Mesh'!AJ84)","v":6},null,{"$f":"INDEX('Raw data'!S187:S199,'Client_Access_&_Mesh'!AL84)","v":6}]
["Z (Aus/NZ)","AIR-LAPxxxxx-Z-K11",35,36,"2.40-2.4835GHz (11 chans)","5.15-5.850GHz","N/A","N/A","N/A",null,"# SS",{"$f":"INDEX('Raw data'!B$187:B$199,'Client_Access_&_Mesh'!$L$83)","v":1},{"$f":"INDEX('Raw data'!C$187:C$199,'Client_Access_&_Mesh'!$L$83)","v":1},{"$f":"INDEX('Raw data'!D$187:D$199,'Client_Access_&_Mesh'!$L$83)","v":0},null,null,null,null,null,null,null,null,"PL value",{"$f":"MIN(INDEX(X74:X82,X83),AH79)","v":23},{"$f":"MIN(INDEX(Y74:Y82,Y83),AJ79)","v":16.979400086720375},{"$f":"MIN(INDEX(Z74:Z82,Z83),AL79)","v":16.979400086720375},null,null,null,null,null,null,"Device choice:",{"$f":"L73","v":1},null,{"$f":"M73","v":1},null,{"$f":"N73","v":1}]
["Country choice:",1,{"$f":"INDEX(C73:C84,$B$85)","v":36},{"$f":"INDEX(D73:D84,$B$85)","v":35},null,null,null,null,null,null,"# MCS",{"$f":"INDEX('Raw data'!E$187:E$199,'Client_Access_&_Mesh'!$L$83)","v":8},{"$f":"INDEX('Raw data'!F$187:F$199,'Client_Access_&_Mesh'!$L$83)","v":8},{"$f":"INDEX('Raw data'!G$187:G$199,'Client_Access_&_Mesh'!$L$83)","v":0},null,"Site 2",null,null,null,null,null,null,null,null,null,null,null,"Site 2"]
[null,null,null,null,null,null,null,null,null,null,"# BF",{"$f":"INDEX('Raw data'!H$187:H$199,'Client_Access_&_Mesh'!$L$83)","v":0},{"$f":"INDEX('Raw data'!I$187:I$199,'Client_Access_&_Mesh'!$L$83)","v":0},{"$f":"INDEX('Raw data'!J$187:J$199,'Client_Access_&_Mesh'!$L$83)","v":0},null,"Radio 1","Radio 1","Radio 2","Radio 2 ","Radio 3","Radio 3",null,"Site 2",null,null,null,null,null,"Radio 1","Radio 2","Radio 3",null,"Site 2"]
[null,null,"Power rules","Correction","TXP per band",null,null,null,null,null,"# TX",{"$f":"INDEX('Raw data'!K$187:K$199,'Client_Access_&_Mesh'!$L$83)","v":1},{"$f":"INDEX('Raw data'!L$187:L$199,'Client_Access_&_Mesh'!$L$83)","v":1},{"$f":"INDEX('Raw data'!M$187:M$199,'Client_Access_&_Mesh'!$L$83)","v":0},null,"Antenna","Gain (dBi)",null,"Gain (dBi)",null,"Gain (dBi)",null,null,"Radio 1","Radio 2","Radio3",null,"Cable","Loss (dB)","Loss (dB)","Loss (dB)",null,null,"Radio 1",null,"Radio 2",null,"Radio 3"]
[null,null,null,null,null,null,null,null,null,null,"# RX",{"$f":"INDEX('Raw data'!N$187:N$199,'Client_Access_&_Mesh'!$L$83)","v":1},{"$f":"INDEX('Raw data'!O$187:O$199,'Client_Access_&_Mesh'!$L$83)","v":1},{"$f":"INDEX('Raw data'!P$187:P$199,'Client_Access_&_Mesh'!$L$83)","v":0},null,{"$f":"INDEX(P125:AB125,L$83)","v":"Integrated"},{"$f":"INDEX(P116:AB116,L$83)","v":-1.4},{"$f":"INDEX(P155:AB155,M$83)","v":"Integrated"},{"$f":"INDEX(P146:AB146,M$83)","v":-2.9},{"$f":"INDEX(P185:AB185,N$83)","v":"N/A"},{"$f":"INDEX(P176:AB176,N$83)","v":0},null,"Level","Power (dBm)","Power (dBm)","Power (dBm)",null,"150ft ULTRA LOW loss",6.6,6.6,6.6,null,"TXP Limit",{"$f":"INDEX(E104:E115,$B$85)","v":30},null,{"$f":"INDEX(F104:I115,$B$85,AJ78)","v":16.979400086720375},null,{"$f":"INDEX(F104:I115,$B$85,AL78)","v":16.979400086720375}]
[null,null,null,"Site 1->Site 2",null,null,null,null,null,null,"NF",{"$f":"INDEX('Raw data'!Q$187:Q$199,'Client_Access_&_Mesh'!$L$83)","v":10},{"$f":"INDEX('Raw data'!R$187:R$199,'Client_Access_&_Mesh'!$L$83)","v":10},{"$f":"INDEX('Raw data'!S$187:S$199,'Client_Access_&_Mesh'!$L$83)","v":0},null,"N/A",0,"N/A",0,"N/A",0,null,"PL1",{"$f":"INDEX(P106:AB106,L$83)","v":16},{"$f":"INDEX(P136:AB136,M$83)","v":13},{"$f":"INDEX(P166:AB166,N$83)","v":0},null,"100ft ULTRA LOW loss",4.4000000000000004,4.4000000000000004,4.4000000000000004,null,"NF",{"$f":"INDEX('Raw data'!Q187:Q199,'Client_Access_&_Mesh'!AH90)","v":10},null,{"$f":"INDEX('Raw data'!R187:R199,'Client_Access_&_Mesh'!AJ90)","v":10},null,{"$f":"INDEX('Raw data'!S187:S199,'Client_Access_&_Mesh'!AL90)","v":0}]
[null,null,"US FCC BeamForming rule",{"$f":"IF(AND($M$76=0,$N$76=0),0,-10*LOG10(MAX($M$76,$N$76)))","v":-6.0205999132796242},30,{"$f":"16+$D90","v":9.9794000867203749},{"$f":"23+$D90","v":16.979400086720375},{"$f":"23+$D90","v":16.979400086720375},29,null,null,null,null,null,null,"N/A",0,"N/A",0,"N/A",0,null,"PL2",0,0,0,null,"100Ft standard cable",6.8,6.8,6.8,null,"Device choice:",{"$f":"L83","v":9},null,{"$f":"M83","v":9},null,{"$f":"N83","v":9}]
[null,null,null,0,{"$f":"$C$74","v":20},{"$f":"$D$74","v":30},0,0,0,null,"MCS table idx",1,31,61,null,"N/A",0,"N/A",0,"N/A",0,null,"PL3",0,0,0,null,"75Ft standard cable",5.0999999999999996,5.0999999999999996,5.0999999999999996]
[null,null,null,0,{"$f":"$C$75","v":20},{"$f":"$D$75","v":30},0,0,0,null,"BW",{"$f":"2^(INT((L91-1)/30)+1)*10","v":20},{"$f":"2^(INT((M91-1)/30)+1)*10","v":40},{"$f":"2^(INT((N91-1)/30)+1)*10","v":80},null,"N/A",2,"N/A",0,"N/A",0,null,"PL4",0,0,0,null,"50Ft standard cable",3.4,3.4,3.4]
[null,null,"ETSI 5Ghz indoor EIRP limit",{"$f":"$E$124","v":5},{"$f":"$C$76","v":20},{"$f":"20-D93","v":15},{"$f":"20-D93","v":15},{"$f":"30-D93","v":25},0,null,"MCS select",{"$f":"MOD(L91-1,30)+1","v":1},{"$f":"MOD(M91-1,30)+1","v":1},1,null,0,0,"N/A",0,"N/A",0,null,"PL5",0,0,0,null,"20Ft standard cable",1.3,1.3,1.3]
[null,null,null,0,{"$f":"$C$77","v":29},{"$f":"$D$77","v":28},0,0,0,null,"Max MCS / SS",{"$f":"MIN(L85,L75)","v":8},{"$f":"MIN(M85,M75)","v":8},{"$f":"MIN(N85,N75)","v":0},null,0,0,"N/A",0,"N/A",0,null,"PL6",0,0,0,null,"NO Cable",0,0,0]
[null,null,null,0,{"$f":"$C$78","v":20},{"$f":"$D$78","v":30},0,0,0,null,"Max SS",{"$f":"MIN(L84,L74)","v":1},{"$f":"MIN(M84,M74)","v":1},{"$f":"MIN(N84,N74)","v":0},null,"Other: Enter Gain Below",{"$f":"O18","v":-1},"Other: Enter Gain Below",{"$f":"R18","v":-1},"Other: Enter Gain Below",{"$f":"U18","v":-1},null,"PL7",0,0,0,null,"Other: enter loss below",{"$f":"O34","v":-1},{"$f":"R34","v":-1},{"$f":"U34","v":-1}]
[null,null,null,0,{"$f":"$C$79","v":35},{"$f":"$D$79","v":36},0,0,0,null,"Max MCS",{"$f":"L95*L94","v":8},{"$f":"M95*M94","v":8},0,null,"Ant choice",1,null,1,null,1,null,"PL8",0,0,0,null,"Cable Choice:",7,7,7]
[null,null,null,0,{"$f":"$C$80","v":25},{"$f":"$D$80","v":26},0,0,0,null,"Mac MCS (base 10)",{"$f":"IF(L95=0,0,(L95-1)*10+L94)","v":8},{"$f":"IF(M95=0,0,(M95-1)*10+M94)","v":8},{"$f":"IF(N95=0,0,(N95-1)*10+N94)","v":0},null,"Actual dBi",{"$f":"IF(Q96<>8,INDEX(Q88:Q95,Q96),Q95)","v":-1.4}," ",{"$f":"IF(S96<>8,INDEX(S88:S95,S96),S95)","v":-2.9}," ",{"$f":"IF(U96<>8,INDEX(U88:U95,U96),U95)","v":0},null,"Other: enter TXP",{"$f":"O29","v":-1},{"$f":"R29","v":-1},{"$f":"U29","v":-1},null,"Cable value",{"$f":"IF(AC96<>8,INDEX(AC88:AC95,AC96),AC95)","v":0},{"$f":"IF(AD96<>8,INDEX(AD88:AD95,AD96),AD95)","v":0},{"$f":"IF(AE96<>8,INDEX(AE88:AE95,AE96),AE95)","v":0}]
[null,null,null,0,{"$f":"$C$81","v":25},{"$f":"$D$81","v":38},0,0,0,null,null,null,null,null,null,null,null,null,null,null,null,null,"PL Choice:",1,1,1]
[null,null,null,0,{"$f":"$C$82","v":20},{"$f":"$D$82","v":30},0,0,0,null,"Convert MCS selection to SNR table based on 10 MCS per SS",null,null,null,null,null,null,null,null,null,null,null,"PL Value",{"$f":"MIN(INDEX(X89:X97,X98),AH88)","v":16},{"$f":"MIN(INDEX(Y89:Y97,Y98),AJ88)","v":13},{"$f":"MIN(INDEX(Z89:Z97,Z98),AL88)","v":0}]
[null,null,null,0,{"$f":"$C$83","v":35},{"$f":"$D$83","v":36},0,0,0,null,"MCS (native)",{"$f":"MIN(L93,L97)","v":1},{"$f":"MIN(M93,M97)","v":1},{"$f":"MIN(N93,N97)","v":0}]
[null,null,null,0,{"$f":"$C$84","v":35},{"$f":"$D$84","v":36},0,0,0,null,"MCS (base 10)",{"$f":"L100","v":1},{"$f":"M100","v":1},0]
[]
[null,null,null,"Site 2->Site 1",null,null,null,null,null,null,"Determine SNR curve based on site 1 -> site 2 (site 2->site 1)"]
[null,null,null,{"$f":"IF(AND($M$76=0,$N$76=0),0,-10*LOG10(MAX($M$76,$N$76)))","v":-6.0205999132796242},30,{"$f":"16+$D104","v":9.9794000867203749},{"$f":"23+$D104","v":16.979400086720375},{"$f":"23+$D104","v":16.979400086720375},29,null,"PER idx",{"$f":"IF('SLA QoS'!$D$53=2,0,1)","v":1},{"$f":"IF('SLA QoS'!$D$53=2,0,1)","v":1},{"$f":"IF('SLA QoS'!$D$53=2,0,1)","v":1},"Radio 1"]
[null,null,null,0,{"$f":"$C$74","v":20},{"$f":"$D$74","v":30},0,0,0,null,"Site 1 -> 2 idx",{"$f":"IF(L$94<>0,IF(AND(L$92=80, L$77=3, L$88=3),IF(L$76,24+L$104+1,26+L$104+1),IF(L$76,((4-L$76)+(4-L$88)*2)*2+L$104+1,(4-L$88)*2+16+L$104+1)),0)","v":14},{"$f":"IF(M$94<>0,IF(AND(M$92=80, M$77=3, M$88=3),IF(M$76,24+M$104+1,26+M$104+1),IF(M$76,((4-M$76)+(4-M$88)*2)*2+M$104+1,(4-M$88)*2+16+M$104+1)),0)","v":14},{"$f":"IF(N$94<>0,IF(AND(N$92=80, N$77=3, N$88=3),IF(N$76,24+N$104+1,26+N$104+1),IF(N$76,((4-N$76)+(4-N$88)*2)*2+N$104+1,(4-N$88)*2+16+N$104+1)),0)","v":0},"TXP","AP3600","AP2600","AP1600","AP3500P","AP1530e","AP1530i","AP1550","iPhone 4S","iPhone 5","Galaxy SIII","iPad 3","MacBook Pro","Generic (3x3)"]
[null,null,null,0,{"$f":"$C$75","v":20},{"$f":"$D$75","v":30},0,0,0,null,"Site 2 -> 1 idx",{"$f":"IF(L$94<>0,IF(AND(L$92=80, L$87=3, L$78=3),IF(L$86,24+L$104+1,26+L$104+1),IF(L$86,((4-L$86)+(4-L$78)*2)*2+L$104+1,(4-L$78)*2+16+L$104+1)),0)","v":18},{"$f":"IF(M$94<>0,IF(AND(M$92=80, M$87=3, M$78=3),IF(M$86,24+M$104+1,26+M$104+1),IF(M$86,((4-M$86)+(4-M$78)*2)*2+M$104+1,(4-M$78)*2+16+M$104+1)),0)","v":18},{"$f":"IF(N$94<>0,IF(AND(N$92=80, N$87=3, N$78=3),IF(N$86,24+N$104+1,26+N$104+1),IF(N$86,((4-N$86)+(4-N$78)*2)*2+N$104+1,(4-N$78)*2+16+N$104+1)),0)","v":0},1,{"$f":"23","v":23},22,22,20,27,29,28,17,16,13,16.5,28,28]
[null,null,"ETSI indoor EIRP limit",{"$f":"$F$124","v":-2.9},{"$f":"$C$76","v":20},{"$f":"20-D107","v":22.9},{"$f":"20-D107","v":22.9},{"$f":"30-D107","v":32.9},0,null,null,null,null,null,2,{"$f":"20","v":20},19,19,17,24,26,25,0,0,0,0,25,25]
[null,null,null,0,{"$f":"$C$77","v":29},{"$f":"$D$77","v":28},0,0,0,null,"SNR Index rule: BF: ((4-BFTX) + (3-RX)*2)*2 noBF: (4-RX)*2",null,null,null,3,{"$f":"17","v":17},16,16,14,21,23,{"$f":"'1552_2G_PwrTable'!R63","v":22},0,0,0,0,22,22]
[null,null,null,0,{"$f":"$C$78","v":20},{"$f":"$D$78","v":30},0,0,0,null,"SNR index rule 2: 3x3 & VHT & 80MHz: BFTX: 0,2",null,null,null,4,{"$f":"14","v":14},13,13,11,18,20,19,0,0,0,0,19,19]
[null,null,null,0,{"$f":"$C$79","v":35},{"$f":"$D$79","v":36},0,0,0,null,null,null,null,null,5,{"$f":"11","v":11},10,10,8,15,17,16,0,0,0,0,16,16]
[null,null,null,0,{"$f":"$C$80","v":25},{"$f":"$D$80","v":26},0,0,0,null,null,null,null,null,6,{"$f":"8","v":8},7,7,5,12,14,13,0,0,0,0,13,13]
[null,null,null,0,{"$f":"$C$81","v":25},{"$f":"$D$81","v":38},0,0,0,null,null,null,null,null,7,{"$f":"5","v":5},4,4,2,9,11,10,0,0,0,0,10,10]
[null,null,null,0,{"$f":"$C$82","v":20},{"$f":"$D$82","v":30},0,0,0,null,null,null,null,null,8,2,1,1,-1,6,8,7,0,0,0,0,7,7]
[null,null,null,0,{"$f":"$C$83","v":35},{"$f":"$D$83","v":36},0,0,0,null,null,null,null,null,9,0,0,0,-4,3,5,4,0,0,0,0,0,0]
[null,null,null,0,{"$f":"$C$84","v":35},{"$f":"$D$84","v":36},0,0,0,null,null,null,null,null,"Ant gain"]
[null,null,null,null,null,null,null,null,null,null,null,null,null,null,1,2,4,4,13,4,3,2,-1.5,-1.4,-1.4,-0.26,4.5999999999999996,4.5999999999999996]
[null,null,null,null,null,null,null,null,null,null,null,null,null,null,2,2,2,2,0,8,0,4,0,0,0,0,0,0]
[null,null,null,null,null,null,null,null,null,null,null,null,null,null,3,2,2,2,0,5,0,8,0,0,0,0,0,0]
["EIRP Calculation",null,null,null,null,null,null,null,null,null,null,null,null,null,4,4,4,4,0,8,0,2,0,0,0,0,0,0]
[null,null,"Radio 1",null,"Radio 2",null,"Radio 3",null,null,null,null,null,null,null,5,6,6,6,0,13,0,5,0,2,0,0,0,0]
[null,null,"Site 1->2","Site 2->1","Site 1->2","Site 2->1","Site 1->2","Site 2->1",null,null,null,null,null,null,6,0,0,0,0,0,0,8,0,0,0,0,0,0]
[null,"TXP (dBm)",{"$f":"X84","v":23},{"$f":"X99","v":16},{"$f":"Y84","v":16.979400086720375},{"$f":"Y99","v":13},{"$f":"Z84","v":16.979400086720375},{"$f":"Z99","v":0},null,null,null,null,null,null,7,0,0,0,0,0,0,13,0,0,0,0,0,0]
[null,"Tx Cable Loss (dB)",{"$f":"-1*AC83","v":0},{"$f":"-1*AC97","v":0},{"$f":"-1*AD83","v":0},{"$f":"-1*AD97","v":0},{"$f":"-1*AE83","v":0},{"$f":"-1*AE97","v":0},null,null,null,null,null,null,8]
[null,"Tx Antenna Gain (dBi)",{"$f":"Q83","v":2},{"$f":"Q97","v":-1.4},{"$f":"S83","v":5},{"$f":"S97","v":-2.9},{"$f":"U83","v":5},{"$f":"U97","v":0},null,null,null,null,null,null,"Antenna"]
[null,"Tx EIRP (dBm)",{"$f":"SUM(C122:C124)","v":25},{"$f":"SUM(D122:D124)","v":14.6},{"$f":"SUM(E122:E124)","v":21.979400086720375},{"$f":"SUM(F122:F124)","v":10.1},{"$f":"SUM(G122:G124)","v":21.979400086720375},0,null,null,null,null,null,null,1,"Integrated","Integrated","Integrated","AIR-ANT25137NP-R","AIR-ANT2547V-N (omni)","Integrated (C/I)","Integrated (C/I)","Integrated","Integrated","Integrated","Integrated","Integrated","Integrated"]
[null,"EIRP Limit Flag",{"$f":"IF(C125>$C$85,1,0)","v":0},{"$f":"IF(D125>$C$85,1,0)","v":0},{"$f":"IF(E125>$D$85,1,0)","v":0},{"$f":"IF(F125>$D$85,1,0)","v":0},{"$f":"IF(G125>$D$85,1,0)","v":0},{"$f":"IF(H125>$D$85,1,0)","v":0},null,null,null,null,null,null,2,"AIR-ANT2524Dx-R (dipole)","AIR-ANT2524Dx-R (dipole)","AIR-ANT2524Dx-R (dipole)","N/A","AIR-ANT2588P3M-N (directional)","N/A","AIR-ANT2547V-N (omni - E,H,S)","N/A","N/A","N/A","N/A","N/A","N/A"]
[null,"Rx Antenna Gain (dBi)",{"$f":"D124","v":-1.4},{"$f":"C124","v":2},{"$f":"F124","v":-2.9},{"$f":"E124","v":5},{"$f":"H124","v":0},{"$f":"G124","v":5},null,null,null,null,null,null,3,"AIR-ANT2524V4C-R (ceiling)","AIR-ANT2524V4C-R (ceiling)","AIR-ANT2524V4C-R (ceiling)","N/A","AIR-ANT2450V-N (omni)","N/A","AIR-ANT2588P3M-N (directional - E)","N/A","N/A","N/A","N/A","N/A","N/A"]
[null,"Rx Cable Loss (dB)",{"$f":"D123","v":0},{"$f":"C123","v":0},{"$f":"F123","v":0},{"$f":"E123","v":0},{"$f":"H123","v":0},{"$f":"G123","v":0},null,null,null,null,null,null,4,"AIR-ANT2544V4M-R (wall)","AIR-ANT2544V4M-R (wall)","AIR-ANT2544V4M-R (wall)","N/A","AIR-ANT2480V-N (omni)","N/A","AIR-ANT2420V-N (omni - CU)","N/A","N/A","N/A","N/A","N/A","N/A"]
[null,"Rx Sensitivity (dBm)",{"$f":"C137","v":-80.789700043360185},{"$f":"D137","v":-94.499320043360186},-77.779400086720372,-91.489020086720373,905.03089986991949,911.03089986991949,null,null,null,null,null,null,5,"AIR-ANT2566P4W-R (patch)","AIR-ANT2566P4W-R (patch)","AIR-ANT2566P4W-R (patch)","N/A","AIR-ANT2413P2M-N (directional)","N/A","AIR-ANT2450V-N (omni - EU/CU)","N/A","N/A","N/A","N/A","N/A","N/A"]
[null,"Pathloss",{"$f":"C125+C127+C128+C128-C129","v":104.38970004336019},{"$f":"D125+D127+D128+D128-D129","v":111.09932004336019},96.858800173440756,106.58902008672037,-883.05149978319912,-906.03089986991949,null,null,null,null,null,null,6,"N/A","N/A","N/A","N/A","N/A","N/A","AIR-ANT2480V-N (omni - EU/CU)",null,null,"N/A","N/A","N/A","N/A"]
[null,"Min Pathloss",{"$f":"MIN(C130:D130)","v":104.38970004336019},null,{"$f":"MIN(E130:F130)","v":96.858800173440756},null,{"$f":"MIN(G130:H130)","v":-906.03089986991949},null,null,null,null,null,null,null,7,"N/A","N/A","N/A","N/A","N/A","N/A","AIR-ANT2413P2M-N (directional - EU/CU)",null,null,"N/A","N/A","N/A","N/A"]
[null,"RSSI",{"$f":"C125+C127+C128-C131","v":-80.789700043360199},{"$f":"D125+D127+D128-C131","v":-87.789700043360199},{"$f":"E125+E127+E128-E131","v":-77.779400086720386},{"$f":"F125+F127+F128-E131","v":-81.758800173440761},928.01029995663987,{"$f":"H125+H127+H128-G131","v":911.03089986991949},null,null,null,null,null,null,8,"N/A","N/A","N/A","N/A","N/A","N/A","N/A","N/A","N/A","N/A","N/A","N/A","N/A"]
["RX Sensitivity"]
[null,"NF",{"$f":"AH89","v":10},{"$f":"AH83","v":6},{"$f":"AJ89","v":10},{"$f":"AJ83","v":6},{"$f":"AL89","v":0},{"$f":"AL83","v":6},null,null,null,null,null,null,"Radio 2"]
[null,"SNR idx",{"$f":"$L$105","v":14},{"$f":"$L$106","v":18},{"$f":"$M$105","v":14},{"$f":"$M$106","v":18},{"$f":"$N$105","v":0},{"$f":"$N$106","v":0},null,null,null,null,null,null,"TXP","AP3600","AP2600","AP1600","AP3500P","AP1530e","AP1530i","AP1550","iPhone 4S","iPhone 5","Galaxy SIII","iPad 3","MacBook Pro","Generic (3x3)"]
[null,"SNR",{"$f":"IF(C135<>0,INDEX('Raw data'!$B$155:$AE$182,'Client_Access_&_Mesh'!C135,'Client_Access_&_Mesh'!L101),1000)","v":10.199999999999999},{"$f":"IF(D135<>0,INDEX('Raw data'!$B$155:$AE$182,'Client_Access_&_Mesh'!D135,'Client_Access_&_Mesh'!L101),1000)","v":0.49037999999999998},{"$f":"IF(E135<>0,INDEX('Raw data'!$B$155:$AE$182,'Client_Access_&_Mesh'!E135,'Client_Access_&_Mesh'!M101),1000)","v":10.199999999999999},{"$f":"IF(F135<>0,INDEX('Raw data'!$B$155:$AE$182,'Client_Access_&_Mesh'!F135,'Client_Access_&_Mesh'!M101),1000)","v":0.49037999999999998},{"$f":"IF(G135<>0,INDEX('Raw data'!$B$155:$AE$182,'Client_Access_&_Mesh'!G135,'Client_Access_&_Mesh'!N101),1000)","v":1000},{"$f":"IF(H135<>0,INDEX('Raw data'!$B$155:$AE$182,'Client_Access_&_Mesh'!H135,'Client_Access_&_Mesh'!N101),1000)","v":1000},null,null,null,null,null,null,1,{"$f":"23","v":23},23,22,17,27,27,27,0,13,15,17.5,26,26]
[null,"Rx sens",{"$f":"-($AH$82-C134-C136)","v":-80.789700043360185},{"$f":"-($AH$82-D134-D136)","v":-94.499320043360186},{"$f":"-($AJ$82-E134-E136)","v":-77.779400086720372},{"$f":"-($AJ$82-F134-F136)","v":-91.489020086720373},{"$f":"-($AL$82-G134-G136)","v":905.03089986991949},{"$f":"-($AL$82-H134-H136)","v":911.03089986991949},null,null,null,null,null,null,2,{"$f":"20","v":20},20,19,14,24,24,24,0,0,0,0,25,25]
[null,"Data rate (Mb/s)",{"$f":"IF(C135<>0,INDEX('Raw data'!$B$151:$AE$153,INT(LOG(L$92/10,2)),'Client_Access_&_Mesh'!L$101),0)","v":6.5},null,{"$f":"IF(E135<>0,INDEX('Raw data'!$B$151:$AE$153,INT(LOG(M$92/10,2)),'Client_Access_&_Mesh'!M$101),0)","v":13.5},null,{"$f":"IF(G135<>0,INDEX('Raw data'!$B$151:$AE$153,INT(LOG(N$92/10,2)),'Client_Access_&_Mesh'!N$101),0)","v":0},null,null,null,null,null,null,null,3,{"$f":"17","v":17},17,16,11,21,21,21,0,0,0,0,22,22]
["LOS",null," "," ",null,null,null,null,null,null,null,null,null,null,4,{"$f":"14","v":14},14,13,8,18,18,18,0,0,0,0,19,19]
[null,"LOS","Radio 1","Radio 2","Radio 3",null,null,null,null,null,null,null,null,null,5,{"$f":"11","v":11},11,10,5,15,15,15,0,0,0,0,16,16]
[null,"Link margin",{"$f":"'SLA QoS'!$F$53","v":7.8000000000000007},{"$f":"'SLA QoS'!$F$53","v":7.8000000000000007},{"$f":"'SLA QoS'!$F$53","v":7.8000000000000007},null,null,null,null,null,null,null,null,null,6,{"$f":"8","v":8},8,7,2,12,12,12,0,0,0,0,13,13]
[null,"LOS (2.0)",{"$f":"((0.3/$AH$81)/(4*PI()*POWER(10^((-$C$131+$C$141)/10),(1/2))))","v":671.71516172200677},{"$f":"((0.3/$AJ$81)/(4*PI()*POWER(10^((-$E$131+$D$141)/10),(1/2))))","v":135.48193633275991},{"$f":"((0.3/$AL$81)/(4*PI()*POWER(10^((-$G$131+$E$141)/10),(1/2))))","v":9.713961835369862E-49},null,null,null,null,null,null,null,null,null,7,{"$f":"5","v":5},5,4,-1,9,9,9,0,0,0,0,10,10]
[null,"LOS w/o (2.2)",{"$f":"((0.3/$AH$81)/(4*PI()*POWER(10^((-$C$131+$C$141)/10),(1/2.2))))","v":244.42243145903521},{"$f":"((0.3/$AJ$81)/(4*PI()*POWER(10^((-$E$131+$D$141)/10),(1/2.2))))","v":53.341922855998355},{"$f":"((0.3/$AL$81)/(4*PI()*POWER(10^((-$G$131+$E$141)/10),(1/2.2))))","v":1.384118299315151E-44},null,null,null,null,null,null,null,null,null,8,2,2,1,-4,6,6,6,0,0,0,0,7,7]
[null,"LOS w/o (2.3)",{"$f":"((0.3/$AH$81)/(4*PI()*POWER(10^((-$C$131+$C$141)/10),(1/2.3))))","v":157.48976130962666},{"$f":"((0.3/$AJ$81)/(4*PI()*POWER(10^((-$E$131+$D$141)/10),(1/2.3))))","v":35.568302016010691},{"$f":"((0.3/$AL$81)/(4*PI()*POWER(10^((-$G$131+$E$141)/10),(1/2.3))))","v":8.8544814236984582E-43},null,null,null,null,null,null,null,null,null,9,0,0,0,0,3,3,3,0,0,0,0,0,0]
[null,"LOS w/o (2.5)",{"$f":"((0.3/$AH$81)/(4*PI()*POWER(10^((-$C$131+$C$141)/10),(1/2.5))))","v":72.658788246359535},{"$f":"((0.3/$AJ$81)/(4*PI()*POWER(10^((-$E$131+$D$141)/10),(1/2.5))))","v":17.42983971290143},{"$f":"((0.3/$AL$81)/(4*PI()*POWER(10^((-$G$131+$E$141)/10),(1/2.5))))","v":1.3356891297504239E-39},null,null,null,null,null,null,null,null,null,"Ant gain"]
[null,"LOS w/o (2.7)",{"$f":"((0.3/$AH$81)/(4*PI()*POWER(10^((-$C$131+$C$141)/10),(1/2.7))))","v":37.592087846295655},{"$f":"((0.3/$AJ$81)/(4*PI()*POWER(10^((-$E$131+$D$141)/10),(1/2.7))))","v":9.4932619985728941},{"$f":"((0.3/$AL$81)/(4*PI()*POWER(10^((-$G$131+$E$141)/10),(1/2.7))))","v":6.8132214069649894E-37},null,null,null,null,null,null,null,null,null,1,5,4,4,7,7,5,4,0,-2.9,-2.9,4.5,7,7]
[null,null,null,null,null,null,null,null,null,null,null,null,null,null,2,4,4,4,0,8,0,4,0,0,0,0,0,0]
["Outfoor (COST-231 HATA)",null,null,null,null,null,null,null,null,null,null,null,null,null,3,4,4,4,0,8,0,8,0,0,0,0,0,0]
[null,null,null,null,null,null,null,null,null,null,null,null,null,null,4,4,4,4,0,14,0,7,0,0,0,0,0,0]
[null,null,"Radio 1","Radio 2","Radio 3",null,null,null,null,null,null,null,null,null,5,6,6,6,0,0,0,8,0,0,0,0,0,0]
[null,"Frequency_term",{"$f":"33.9*LOG10(1000*AH81)","v":114.58916109402344},{"$f":"33.9*LOG10(1000*AJ81)","v":125.39508314699103},{"$f":"33.9*LOG10(1000*AL81)","v":125.39508314699103},null,null,null,null,null,null,null,null,null,6,0,0,0,0,0,0,14,0,0,0,0,0,0]
[null,"Tx_height_factor",{"$f":"13.82*LOG10(MAX(D22,O22))","v":8.3204690801524404},{"$f":"13.82*LOG10(MAX(D22,O22))","v":8.3204690801524404},{"$f":"13.82*LOG10(MAX(D22,O22))","v":8.3204690801524404},null,null,null,null,null,null,null,null,null,7,0,0,0,0,0,0,0,0,0,0,0,0,0]
[null,"A_factor_suburban",{"$f":"(1.1*LOG10(1000*AH81)-0.7)*MIN(D22,O22) - (1.56*LOG10(1000*AH81) - 0.8)","v":1.5633351946954281},{"$f":"(1.1*LOG10(1000*AJ81)-0.7)*MIN(D22,O22) - (1.56*LOG10(1000*AJ81) - 0.8)","v":1.7673408027750526},{"$f":"(1.1*LOG10(1000*AL81)-0.7)*MIN(D22,O22) - (1.56*LOG10(1000*AL81) - 0.8)","v":1.7673408027750526},null,null,null,null,null,null,null,null,null,8]
[null,"A_factor_urban",{"$f":"3.2*POWER(LOG10(11.75*MIN(D22, O22)), 2) - 4.97","v":1.0454466654540449},{"$f":"3.2*POWER(LOG10(11.75*MIN(D22, O22)), 2) - 4.97","v":1.0454466654540449},{"$f":"3.2*POWER(LOG10(11.75*MIN(D22, O22)), 2) - 4.97","v":1.0454466654540449},null,null,null,null,null,null,null,null,null,"Antenna"]
[null,"Cm_term_suburban",0,0,0,null,null,null,null,null,null,null,null,null,1,"Integrated","Integrated","Integrated","AIR-ANT25137NP-R","AIR-ANT2547V-N (omni)","Integrated (C/I)","Integrated (C/I)","N/A","Integrated","Integrated","Integrated","Integrated","Integrated"]
[null,"Cm_term_urban",3,3,3,null,null,null,null,null,null,null,null,null,2,"AIR-ANT2524Dx-R (dipole)","AIR-ANT2524Dx-R (dipole)","AIR-ANT2524Dx-R (dipole)","N/A","AIR-ANT2588P3M-N (directional)","N/A","AIR-ANT5140V (omni - CU)","N/A","N/A","N/A","N/A","N/A","N/A"]
[null,"path-loss-exp (v)",{"$f":"(44.9 - 6.55*LOG10(MAX(D22,O22)))/10","v":4.0956507056801845},{"$f":"(44.9 - 6.55*LOG10(MAX(D22,O22)))/10","v":4.0956507056801845},{"$f":"(44.9 - 6.55*LOG10(MAX(D22,O22)))/10","v":4.0956507056801845},null,null,null,null,null,null,null,null,null,3,"AIR-ANT2524V4C-R (ceiling)","AIR-ANT2524V4C-R (ceiling)","AIR-ANT2524V4C-R (ceiling)","N/A","AIR-ANT5180V-N (omni)","N/A","AIR-ANT5180V-N (omni - EU/CU)","N/A","N/A","N/A","N/A","N/A","N/A"]
[null,"Distance (suburban)",{"$f":"1000*POWER(10, ((C131 - C141 - 46.3 - C151 + C152 + C153 - C155) / (44.9 - 6.55*LOG10(MAX(D22,O22)))))","v":46.922317496825649},{"$f":"1000*POWER(10, ((E131 - D141 - 46.3 - D151 + D152 + D153 - D155) / (44.9 - 6.55*LOG10(MAX(D22,O22)))))","v":16.929572362071017},{"$f":"1000*POWER(10, ((G131 - E141 - 46.3 - E151 + E152 + E153 - E155) / (44.9 - 6.55*LOG10(MAX(D22,O22)))))","v":5.5200882375270584E-24},null,null,null,null,null,null,null,null,null,4,"AIR-ANT2544V4M-R (wall)","AIR-ANT2544V4M-R (wall)","AIR-ANT2544V4M-R (wall)","N/A","AIR-ANT5114P2M-N (directional)","N/A","AIR-ANT2547V-N (omni - E,H,S)","N/A","N/A","N/A","N/A","N/A","N/A"]
[null,"Distance (urban)",{"$f":"1000*POWER(10, ((C131 - C141 - 46.3 - C151 + C152 + C154 - C156) / (44.9 - 6.55*LOG10(MAX(D22,O22)))))","v":38.502256122617901},{"$f":"1000*POWER(10, ((E131 - D141  - 46.3 - D151 + D152 + D154 - D156) / (44.9 - 6.55*LOG10(MAX(D22,O22)))))","v":13.73319802796029},{"$f":"1000*POWER(10, ((G131 - E141  - 46.3 - E151 + E152 + E154 - E156) / (44.9 - 6.55*LOG10(MAX(D22,O22)))))","v":4.4778724043623218E-24},null,null,null,null,null,null,null,null,null,5,"AIR-ANT2566P4W-R (patch)","AIR-ANT2566P4W-R (patch)","AIR-ANT2566P4W-R (patch)","N/A","N/A","N/A","AIR-ANT2588P3M-N (directional - E)","N/A","N/A","N/A","N/A","N/A","N/A"]
[null,"sir",null,null,null,null,null,null,null,null,null,null,null,null,6,"N/A","N/A","N/A","N/A","N/A","N/A","AIR-ANT5114P2M-N (directional - EU/CU)",null,"N/A","N/A","N/A","N/A","N/A"]
["Indoor",null,null,null,null,null,null,null,null,null,null,null,null,null,7,"N/A","N/A","N/A","N/A","N/A","N/A","N/A",null,"N/A","N/A","N/A","N/A","N/A"]
[null,null,"Range",null,null,null,null,null,null,null,null,null,null,null,8,"N/A","N/A","N/A","N/A","N/A","N/A","N/A",null,"N/A","N/A","N/A","N/A","N/A"]
["Drywall office",null,"Radio 1","Radio 2","Radio 3"]
["Cubes & walled office",null,{"$f":"10^((-$C$131+$C$141-(-40))/(10*(-3.8)))","v":30.846268368990977},{"$f":"10^((-$E$131+$D$141-(-47))/(10*(-3.8)))","v":12.788232717829018},{"$f":"10^((-$G$131+$E$141-(-47))/(10*(-3.8)))","v":5.1877175107596816E-26},null,null,null,null,null,null,null,null,null,"Radio 3"]
["Indoor high-ceiling",null,{"$f":"10^((-$C$131+$C$141-(-40))/(10*(-3.6)))","v":37.319525418672633},{"$f":"10^((-$E$131+$D$141-(-47))/(10*(-3.6)))","v":14.733299075762316},{"$f":"10^((-$G$131+$E$141-(-47))/(10*(-3.6)))","v":2.0429266855140158E-27},null,null,null,null,null,null,null,null,null,"TXP","AP3600","AP2600","AP1600","AP3500P","AP1530e","AP1530i","AP1550","iPhone 4S","iPhone 5","Galaxy SIII","iPad 3","MacBook Pro","Generic (3x3)"]
[null,null,{"$f":"10^((-$C$131+$C$141-(-40))/(10*(-3.3)))","v":51.860821898248538},{"$f":"10^((-$E$131+$D$141-(-47))/(10*(-3.3)))","v":18.815211136889658},{"$f":"10^((-$G$131+$E$141-(-47))/(10*(-3.3)))","v":7.6544171229280675E-30},null,null,null,null,null,null,null,null,null,1,{"$f":"23","v":23},0,0,0,0,0,0,0,0,0,0,0,26]
[null,null,null,null,null,null,null,null,null,null,null,null,null,null,2,{"$f":"20","v":20},0,0,0,0,0,0,0,0,0,0,0,25]
[null,null,"50%-ile Accuracy",null,null,null,null,null,null,null,null,null,null,null,3,{"$f":"17","v":17},0,0,0,0,0,0,0,0,0,0,0,22]
["Drywall office",null,"Radio 1: 50%-ile","Radio 2: 50%-ile","Radio 3: 50%-ile",null,null,null,null,null,null,null,null,null,4,{"$f":"14","v":14},0,0,0,0,0,0,0,0,0,0,0,19]
["Cubes & walled office",null,{"$f":"0.5761*C164-0.2315","v":17.539035207375701},7.1358008687412973,-0.23150000000000001,null,null,null,null,null,null,null,null,null,5,{"$f":"11","v":11},0,0,0,0,0,0,0,0,0,0,0,16]
["Indoor high-ceiling",null,21.2682785936973,8.2563535975466689,-0.23150000000000001,null,null,null,null,null,null,null,null,null,6,{"$f":"8","v":8},0,0,0,0,0,0,0,0,0,0,0,13]
[null,null,{"$f":"0.2347*C166+5.3745","v":17.546234899518932},{"$f":"0.2347*D166+5.3745","v":9.790430053828004},{"$f":"0.2347*E166+5.3745","v":5.3745000000000003},null,null,null,null,null,null,null,null,null,7,{"$f":"5","v":5},0,0,0,0,0,0,0,0,0,0,0,10]
[null,null,null,null,null,null,null,null,null,null,null,null,null,null,8,2,0,0,0,0,0,0,0,0,0,0,0,7]
[null,null,"90%-ile Accuracy",null,null,null,null,null,null,null,null,null,null,null,9]
["Drywall office",null,"Radio 1: 90%-ile","Radio 2: 90%-ile","Radio 3: 90%-ile",null,null,null,null,null,null,null,null,null,"Ant gain"]
["Cubes & walled office",null,{"$f":"1.0082*C164-0.4051","v":30.6941077696167},12.487996226115214,-0.40510000000000002,null,null,null,null,null,null,null,null,null,1,5,0,0,0,0,0,0,0,0,0,0,0,7]
["Indoor high-ceiling",null,37.220445527105753,14.449012128183568,-0.40510000000000002,null,null,null,null,null,null,null,null,null,2,0,0,0,0,0,0,0,0,0,0,0,0,0]
[null,null,{"$f":"0.4108*C166+9.4051","v":30.709525635800496},{"$f":"0.4108*D166+9.4051","v":17.134388735034271},{"$f":"0.4108*E166+9.4051","v":9.4050999999999991},null,null,null,null,null,null,null,null,null,3,0,0,0,0,0,0,0,0,0,0,0,0,0]
["WARNINGS",null,null,null,null,null,null,null,null,null,null,null,null,null,4,0,0,0,0,0,0,0,0,0,0,0,0,0]
["EIRP",null,null,null,null,null,null,null,null,null,null,null,null,null,5,0,0,0,0,0,0,0,0,0,0,0,0,0]
[null,"*** MAX EIRP EXCEEDED >>> LOWER POWER or ANTENNA GAIN ***",null,null,null,null,null,null,null,null,null,null,null,null,6,0,0,0,0,0,0,0,0,0,0,0,0,0]
[null,null,null,null,null,null,null,null,null,null,null,null,null,null,7,0,0,0,0,0,0,0,0,0,0,0,0,0]
[null,null,null,null,null,null,null,null,null,null,null,null,null,null,8]
[null,null,null,null,null,null,null,null,null,null,null,null,null,null,"Antenna"]
[null,null,null,null,null,null,null,null,null,null,null,null,null,null,1,"Integrated","N/A","N/A","N/A","N/A","N/A","N/A","N/A","N/A","N/A","N/A","N/A","Integrated"]
[null,null,null,null,null,null,null,null,null,null,null,null,null,null,2,"N/A","N/A","N/A","N/A","N/A","N/A","N/A","N/A","N/A","N/A","N/A","N/A","N/A"]
[null,null,null,null,null,null,null,null,null,null,null,null,null,null,3,"N/A","N/A","N/A","N/A","N/A","N/A","N/A","N/A","N/A","N/A","N/A","N/A","N/A"]
[null,null,null,null,null,null,null,null,null,null,null,null,null,null,4,"N/A","N/A","N/A","N/A","N/A","N/A","N/A","N/A","N/A","N/A","N/A","N/A","N/A"]
[null,null,null,null,null,null,null,null,null,null,null,null,null,null,5,"N/A","N/A","N/A","N/A","N/A","N/A","N/A","N/A","N/A","N/A","N/A","N/A","N/A"]
[null,null,null,null,null,null,null,null,null,null,null,null,null,null,6,"N/A","N/A","N/A","N/A","N/A","N/A","N/A","N/A","N/A","N/A","N/A","N/A","N/A"]
[null,null,null,null,null,null,null,null,null,null,null,null,null,null,7,"N/A","N/A","N/A","N/A","N/A","N/A","N/A","N/A","N/A","N/A","N/A","N/A","N/A"]
[null,null,null,null,null,null,null,null,null,null,null,null,null,null,8,"N/A","N/A","N/A","N/A","N/A","N/A","N/A","N/A","N/A","N/A","N/A","N/A","N/A"]

{"sheet":"Raw data","index":8,"n_rows":454,"n_cols":52,"rows_kept":454,"cut":false,"hidden":true,"merged":[]}
[]
[]
[]
[]
[]
[]
["QoS class parameters","AC_BE","AC_VI","AC_VO",null,"Generic parameters",null,null,"QoS Mode",{"$f":"'SLA QoS'!$C$32-1","v":0}]
["SDU size",{"$f":"MIN('SLA QoS'!$C$34,3839)","v":1530},{"$f":"MIN('SLA QoS'!$F$49,3839)","v":1560},{"$f":"MIN('SLA QoS'!$C$49,3839)","v":200},null,"aSlotTime",9.0000000000000002E-6]
["MSDU size",{"$f":"B$8+$G$14","v":1570},{"$f":"C$8+$G$14","v":1600},{"$f":"D$8+$G$14","v":240},null,"SIFS",1.5999999999999999E-5,null,"AMSDU Mode - n x MSDU & m x MPDU/PPDU per TXOP"]
["Periodicity (ms)",{"$f":"0","v":0},{"$f":"'SLA QoS'!G47","v":20},{"$f":"'SLA QoS'!D47","v":20},null,"RIFS",1.9999999999999999E-6,null,"non-AMSDU Mode - 1 x MSDU & 1 x MPDU/PPDU per TXOP"]
["Actual users",{"$f":"'SLA QoS'!$C$33","v":10},{"$f":"IF($J$7=0, 0, 'SLA QoS'!$F$48)","v":0},{"$f":"IF($J$7=0, 0, 'SLA QoS'!$C$48)","v":0},null,"PreMF_1SS=",3.1999999999999999E-5]
["M (num_contending_users)",{"$f":"B$11","v":10},{"$f":"C$11","v":0},0,null,"PreMF_2SS",{"$f":"$G$11+0.000006","v":3.8000000000000002E-5}]
["BW",0,{"$f":"'SLA QoS'!$F$47","v":1248},{"$f":"'SLA QoS'!$C$47","v":160},null,"PreMF_3SS",{"$f":"$G$11+0.000012","v":4.3999999999999999E-5}]
["AMSDU Mode",true,false,false,null,"MPDU",40]
[null,null,null,null,null,"ACK",14]
[null,null,null,null,null,"BAR",24]
[null,null,null,null,null,"BA",32]
["EDCA (AIFS[AC] = aSIFSTime + AIFSN[AC] x aSlotTime)","AIFS[AC_BE] = aSIFSTime + AIFSN[AC] x aSlotTime [Cwmax=31] ",null,null,null,"BA len (blks)",32]
["TXOP (s)",0.01,{"$f":"3008/1000000","v":3.0079999999999998E-3},{"$f":"1504/1000000","v":1.5039999999999999E-3},null,"AMSDU len",8192]
["CW (min)",15,7,3,null,"AMSDU hdr",14]
["CW (max)",1023,15,7,null,"11n MPDU len",{"$f":"G19*8","v":65536}]
["CW (range)",{"$f":"B21","v":1023},{"$f":"C21","v":15},7,null,"11ac MPDU len",4694280]
["AIFSN",7,3,2,null,"RTX_LIMIT",3]
["Min. AIFS",0,0,0]
["PDU (bytes)",7955,7955,7955]
["Min . Backoff",0,0,0]
["Access delay",{"$f":"B$24+B$26","v":0},{"$f":"C$24+C$26","v":0},{"$f":"D$24+D$26","v":0}]
[]
["CSMA statistics (per-class)",null,null,null,"Sytem-wide"]
["P(Success)",{"$f":"$I$392","v":0.57151914359628719},{"$f":"$R$390","v":0},{"$f":"$AA$390","v":0},"P(Collision)",{"$f":"1-SUM(B30:D30)","v":0.42848085640371281}]
["Ptx",{"$f":"$J$392","v":5.8165419842614467E-2},{"$f":"$S$390","v":0},{"$f":"$AB$390","v":0},"E[R]",{"$f":"$AC$390","v":35.809777669339915}]
["Ps",{"$f":"IF(B$12<>0,B$30/B$12,0)","v":5.7151914359628721E-2},{"$f":"IF(C$12<>0,C$30/C$12,0)","v":0},{"$f":"IF(D$12<>0,D$30/D$12,0)","v":0},"E[T]",1]
["Ps|Ptx",{"$f":"IF(B$31<>0,B$32/B$31,0)","v":0.9825754634673296},{"$f":"IF(C$31<>0,C$32/C$31,0)","v":0},{"$f":"IF(D$31<>0,D$32/D$31,0)","v":0}]
["X*Ps|tx*(1-PPs|tx)^(X-1) [x=1]",{"$f":"B$33","v":0.9825754634673296},{"$f":"C$33","v":0},{"$f":"D$33","v":0}]
["X*Ps|tx*(1-PPs|tx)^(X-1) [x=2]",{"$f":"B$33*(1-B$33)^1","v":1.7120922059292033E-2},{"$f":"C$33*(1-C$33)^1","v":0},{"$f":"D$33*(1-D$33)^1","v":0}]
["X*Ps|tx*(1-PPs|tx)^(X-1) [x=3]",{"$f":"B$33*(1-B$33)^2","v":2.9832413189513651E-4},{"$f":"C$33*(1-C$33)^2","v":0},{"$f":"D$33*(1-D$33)^2","v":0}]
["sum x=1:3",{"$f":"SUM(B$34:B$36)","v":0.99999470965851678},{"$f":"SUM(C$34:C$36)","v":0},{"$f":"SUM(D$34:D$36)","v":0}]
["RTX_LIMIT(1-Ps|tx)^RTX_LIMIT",{"$f":"$G$23*(1-B$33)^$G$23","v":1.5871024449686431E-5},{"$f":"$G$23*(1-C$33)^$G$23","v":3},{"$f":"$G$23*(1-D$33)^$G$23","v":3}]
[]
["CSMA statistics (BE-only)",null,null,null,"Sytem-wide"]
["P(Success)",{"$f":"$I$454","v":0.57151914359628719},null,null,"P(Collision)",{"$f":"1-B41","v":0.42848085640371281}]
["Ptx",{"$f":"$J$454","v":5.8165419842614467E-2},null,null,"E[R]",{"$f":"$B$454","v":36.809777669339915}]
["Ps",{"$f":"IF(B$12<>0,B$41/B$12,0)","v":5.7151914359628721E-2},null,null,"E[T]",1]
["Ps|Ptx",{"$f":"IF(B$42<>0,B$43/B$42,0)","v":0.9825754634673296}]
["X*Ps|tx*(1-PPs|tx)^(X-1) [x=1]",{"$f":"B$44","v":0.9825754634673296}]
["X*Ps|tx*(1-PPs|tx)^(X-1) [x=2]",{"$f":"B$44*(1-B$44)^1","v":1.7120922059292033E-2}]
["X*Ps|tx*(1-PPs|tx)^(X-1) [x=3]",{"$f":"B$44*(1-B$44)^2","v":2.9832413189513651E-4}]
["sum x=1:3",{"$f":"SUM(B$45:B$47)","v":0.99999470965851678}]
["RTX_LIMIT(1-Ps|tx)^RTX_LIMIT",{"$f":"$G$23*(1-B$44)^$G$23","v":1.5871024449686431E-5}]
[]
[]
[]
[null,null,null,"AC_BE",null,null,null,null,null,null,null,null,null,null,null,null,null,null,null,null,null,null,null,null,"AC_VI",null,null,null,null,null,null,null,null,null,null,null,null,null,"AC_VO"]
["MCS","Rate (Mbps)","Pre OH (bits)","% of TXOP","TXOP (bytes)","# MSDU / TXOP","# MPDU / TXOP","MAC OH (bits)","Access delay (bits)","Data (bits)","Data slots","OH slots","MAC Efficiency","a (scaled)","Total eff (QoS)","Thru (QoS)","% non-BE TXOP","Total Eff (BE-only)","Thru (BE-only)","Thru (QoS+BE)","Ntx (QoS)","Dend (QoS)","Ntx (BE-only)","Dend (BE-only)","TXOP (bytes)","# MSDU / TXOP","# MPDU / TXOP","MAC OH (bits)","Access delay (bits)","Data (bits)","Data slots","OH slots","MAC Efficiency","a (scaled)","CSMA+MAC Efficiency","Actual thru (bps)","Ntx","Dend","TXOP (bytes)","# MSDU / TXOP","# MPDU / TXOP","MAC OH (bits)","Access delay (bits)","Data (bits)","Data slots","OH slots","MAC Efficiency","a (scaled)","CSMA+MAC Efficiency","Actual thru (bps)","Ntx","Dend"]
["MCS0-20 (6.5)",6.5,{"$f":"$G$11*$B55*1000000","v":208},{"$f":"($J55)/($E55*8)","v":0.94153846153846155},{"$f":"($B55*1000000/8)*$B$19","v":8125},{"$f":"IF($B$14,MIN(INT($E55/$B$9),INT($G$21/$B$9)),1)","v":5},{"$f":"INT($F55*$B$9/$G$19)+1","v":1},{"$f":"($F55*$G$20+$G55*($G$14+$G$15))*8","v":992},{"$f":"$B$27*$B55*1000000","v":0},{"$f":"$B$8*$F55*8","v":61200},{"$f":"($J55)/($B55*1000000*$G$8)","v":1046.1538461538462},{"$f":"($I55+$H55+2*$C55)/($B55*1000000*$G$8)","v":24.068376068376068},{"$f":"$J55/($J55+$I55+$H55+2*$C55)","v":0.97751086123179143},{"$f":"1/($K55+$L55)","v":9.3438538205980071E-4},{"$f":"$M55*$B$30/($N55*$F$31+1)","v":0.54057834699396345},{"$f":"$O55*$B55*1000000","v":3513759.2554607624},{"$f":"MIN(($D$11*($D$13/1000)*(IF($AW55<>0,1/$AW55,0))+$C$11*($C$13/1000)*IF($AI55<>0,1/$AI55,0))/$B55,1)","v":0},{"$f":"$M55*$B$41/($N55*$F$42+1)","v":0.54009003378617271},{"$f":"$R55*$B55*1000000","v":3510585.219610123},{"$f":"$S55*(1-$Q55)+$P55*$Q55","v":3510585.219610123},{"$f":"($B$37/$G55)+$B$38","v":1.0000105806829664},{"$f":"IF(P55<>0,(($J55+$I55+$H55+2*$C55)/($B55*1000000))*($N55+1)*$U55/$B$31,0)","v":0.16575315770868032},{"$f":"($B$48/$G55)+$B$49","v":1.0000105806829664},{"$f":"IF(S55<>0,(($J55+$I55+$H55+2*$C55)/($B55*1000000))*($N55+1)*$W55/$B$42,0)","v":0.16575315770868032},{"$f":"($B55*1000000/8)*$C$19","v":2444},{"$f":"IF($C$14,MIN(INT($Y55/$C$9),INT($G$21/$C$9))+1,1)","v":1},{"$f":"IF($C$14,1,INT($Z55*$C$9/$G$21)+1)","v":1},{"$f":"($Z55*$G$20+$AA55*($G$14+$G$15))*8","v":544},{"$f":"$C$27*$B55*1000000","v":0},{"$f":"$C$8*$Z55*8","v":12480},{"$f":"($AD55)/($B55*1000000*$G$8)","v":213.33333333333334},{"$f":"($AC55+$AB55+2*$C55)/($B55*1000000*$G$8)","v":16.410256410256409},{"$f":"$AD55/($AD55+$AC55+$AB55+2*$C55)","v":0.9285714285714286},{"$f":"1/($AE55+$AF55)","v":4.3526785714285716E-3},{"$f":"$AG55*$C$30/($AH55*$F$31+1)","v":0},{"$f":"$AI55*$B55*1000000","v":0},{"$f":"($C$37/$AA55)+$C$38","v":3},{"$f":"IF(AJ55<>0,(($AD55+$AC55+$AB55+2*$C55)/($B55*1000000))*($AH55+1)*AK55/$C$31,0)","v":0},{"$f":"($B55*1000000/8)*$D$19","v":1222},{"$f":"IF($D$14,MIN(INT($AM55/$D$9),INT($G$21/$D$9))+1,1)","v":1},{"$f":"IF($D$14,1,INT($AN55*$D$9/$G$21)+1)","v":1},{"$f":"($AN55*$G$20+$AO55*($G$14+$G$15))*8","v":544},{"$f":"$D$27*$B55*1000000","v":0},{"$f":"$D$8*$AN55*8","v":1600},{"$f":"($AR55)/($B55*1000000*$G$8)","v":27.350427350427349},{"$f":"($AP55+$AQ55+2*$C55)/($B55*1000000*$G$8)","v":16.410256410256409},{"$f":"$AR55/($AR55+$AQ55+$AP55+2*$C55)","v":0.625},{"$f":"1/($AS55+$AT55)","v":2.2851562499999999E-2},{"$f":"$AU55*$D$30/($AV55*$F$31+1)","v":0},{"$f":"$AW55*$B55*1000000","v":0},{"$f":"($D$37/$AO55)+$D$38","v":3},{"$f":"IF(AX55<>0,(($AR55+$AQ55+$AP55+2*$C55)/($B55*1000000))*($AV55+1)*$AY55/$D$31,0)","v":0}]
["MCS1-20 (13)",13,416,{"$f":"($J56)/($E56*8)","v":0.94153846153846155},16250,{"$f":"IF($B$14,MIN(INT($E56/$B$9),INT($G$21/$B$9)),1)","v":10},{"$f":"INT($F56*$B$9/$G$19)+1","v":2},1984,0,122400,1046.1538461538462,24.068376068376068,0.97751086123179143,9.3438538205980071E-4,0.54057834699396345,7027518.5109215248,0,0.54009003378617271,7021170.4392202459,7021170.4392202459,0.50001322585370811,8.2877894176632466E-2,0.50001322585370811,8.2877894176632466E-2,{"$f":"($B56*1000000/8)*$C$19","v":4888},1,1,544,0,12480,106.66666666666667,11.760683760683762,0.90069284064665123,8.4439953810623546E-3,0,0,3,0,{"$f":"($B56*1000000/8)*$D$19","v":2444},1,1,544,0,1600,13.675213675213675,11.760683760683762,0.5376344086021505,3.9314516129032258E-2,0,0,3,0]
["MCS2-20 (19.5)",19.5,624,0.94153846153846155,24375,15,3,2976,0,183600,1046.1538461538462,24.068376068376068,0.97751086123179143,9.3438538205980071E-4,0.54057834699396345,10541277.766382286,0,0.54009003378617271,10531755.658830369,10531755.658830369,0.33334744091062191,5.5252806332616498E-2,0.33334744091062191,5.5252806332616498E-2,7332,1,1,544,0,12480,71.111111111111114,10.210826210826211,0.87443946188340804,1.2296804932735425E-2,0,0,3,0,3666,1,1,544,0,1600,9.116809116809117,10.210826210826211,0.47169811320754718,5.1739386792452831E-2,0,0,3,0]
["MCS3-20 (26)",26,832,0.94153846153846155,32500,20,4,3968,0,244800,1046.1538461538462,24.068376068376068,0.97751086123179143,9.3438538205980071E-4,0.54057834699396345,14055037.02184305,0,0.54009003378617271,14042340.878440492,14042340.878440492,0.25001454843907889,4.1440262410608532E-2,0.25001454843907889,4.1440262410608532E-2,9776,1,1,544,0,12480,53.333333333333336,9.4358974358974361,0.84967320261437906,1.5931372549019607E-2,0,0,3,0,4888,1,1,544,0,1600,6.8376068376068373,9.4358974358974361,0.42016806722689076,6.1449579831932777E-2,0,0,3,0]
["MCS4-20 (39)",39,1248,0.97292307692307689,48750,31,6,6064,0,379440,1081.0256410256411,24.387464387464387,0.9779381443298969,9.0463917525773188E-4,0.54137264308602906,21113533.080355134,0,0.5408986789840099,21095048.480376385,21095048.480376385,0.16668165596753581,2.853532084597701E-2,0.16668165596753581,2.853532084597701E-2,14664,1,1,544,0,12480,35.555555555555557,8.6609686609686616,0.80412371134020622,2.2615979381443298E-2,0,0,3,0,7332,1,1,544,0,1600,4.5584045584045585,8.6609686609686616,0.34482758620689657,7.5646551724137923E-2,0,0,3,0]
["MCS5-20 (52)",52,1664,0.96507692307692305,65000,41,8,8048,0,501840,1072.3076923076924,24.307692307692307,0.97783389450056113,9.1189674523007842E-4,0.54117869718027023,28141292.253374051,0,0.54070122525253461,28116463.7131318,28116463.7131318,0.12501520973176428,2.1231989057315132E-2,0.12501520973176428,2.1231989057315132E-2,19552,1,1,544,0,12480,26.666666666666668,8.2735042735042743,0.76320939334637961,2.8620352250489235E-2,0,0,3,0,9776,1,1,544,0,1600,3.4188034188034186,8.2735042735042743,0.29239766081871343,8.5526315789473673E-2,0,0,3,0]
["MCS6-20 (58.5)",58.5,1872,0.85784615384615381,73125,41,8,8048,0,501840,953.16239316239319,22.396961063627732,0.97704192885178498,1.0250529562021058E-3,0.53862683511752663,31509669.854375307,0,0.53809478922818865,31478545.169849034,31478545.169849034,0.12501520973176428,1.8890312411219631E-2,0.12501520973176428,1.8890312411219631E-2,21996,1,1,544,0,12480,23.703703703703702,8.1443494776828107,0.74427480916030531,3.1399093511450385E-2,0,0,3,0,10998,1,1,544,0,1600,3.0389363722697058,8.1443494776828107,0.27173913043478259,8.9419157608695649E-2,0,0,3,0]
["MCS7-20 (65)",65,2080,0.77206153846153847,81250,41,8,8048,0,501840,857.84615384615381,20.868376068376069,0.97625124501992033,1.1380260209163347E-3,0.53609892609503995,34846430.196177602,0,0.53551336116611992,34808368.475797795,34808368.475797795,0.12501520973176428,1.7016971094343226E-2,0.12501520973176428,1.7016971094343226E-2,24440,1,1,544,0,12480,21.333333333333332,8.0410256410256409,0.72625698324022347,3.4043296089385479E-2,0,0,3,0,12220,1,1,544,0,1600,2.7350427350427351,8.0410256410256409,0.25380710659898476,9.2798223350253797E-2,0,0,3,0]
["MCS8-1-20 (Future)",78,2496,0.64338461538461533,97500,41,8,8048,0,501840,714.87179487179492,18.575498575498575,0.97467371037911743,1.3634244872591671E-3,0.53111363070502515,41426863.194991961,0,0.53042410294783748,41373080.029931322,41373080.029931322,0.12501520973176428,1.4206959119028625E-2,0.12501520973176428,1.4206959119028625E-2,29328,1,1,544,0,12480,17.777777777777779,7.8860398860398861,0.69271758436944941,3.8965364120781526E-2,0,0,3,0,14664,1,1,544,0,1600,2.2792022792022792,7.8860398860398861,0.22421524663677131,9.8374439461883401E-2,0,0,3,0]
["MCS9-1-20 (Future)",0,0,{"$error":"#DIV/0!"},0,0,1,432,0,0,{"$error":"#DIV/0!"},{"$error":"#DIV/0!"},0,{"$error":"#DIV/0!"},{"$error":"#DIV/0!"},{"$error":"#DIV/0!"},{"$error":"#DIV/0!"},{"$error":"#DIV/0!"},{"$error":"#DIV/0!"},{"$error":"#DIV/0!"},1.0000105806829664,{"$error":"#DIV/0!"},1.0000105806829664,{"$error":"#DIV/0!"},0,1,1,544,0,12480,{"$error":"#DIV/0!"},{"$error":"#DIV/0!"},0.95823095823095827,{"$error":"#DIV/0!"},{"$error":"#DIV/0!"},{"$error":"#DIV/0!"},3,{"$error":"#DIV/0!"},0,1,1,544,0,1600,{"$error":"#DIV/0!"},{"$error":"#DIV/0!"},0.74626865671641796,{"$error":"#DIV/0!"},{"$error":"#DIV/0!"},{"$error":"#DIV/0!"},3,{"$error":"#DIV/0!"}]
["MCS8-20 (13)",13,{"$f":"$G$12*$B65*1000000","v":494.00000000000006},0.94153846153846155,16250,10,2,1984,0,122400,1046.1538461538462,25.4017094017094,0.97629454742685762,9.3322272915802567E-4,0.53992745870290026,7019056.9631377039,0,0.53944032017328569,7012724.1622527139,7012724.1622527139,0.50001322585370811,8.2981050978843812E-2,0.50001322585370811,8.2981050978843812E-2,4888,1,1,544,0,12480,106.66666666666667,13.094017094017094,0.8906651441621467,8.3499857265201261E-3,0,0,3,0,2444,1,1,544,0,1600,13.675213675213675,13.094017094017094,0.51085568326947639,3.7356321839080463E-2,0,0,3,0]
["MCS9-20 (26)",26,988.00000000000011,0.94153846153846155,32500,20,4,3968,0,244800,1046.1538461538462,25.4017094017094,0.97629454742685762,9.3322272915802567E-4,0.53992745870290026,14038113.926275408,0,0.53944032017328569,14025448.324505428,14025448.324505428,0.25001454843907889,4.1491842448875021E-2,0.25001454843907889,4.1491842448875021E-2,9776,1,1,544,0,12480,53.333333333333336,10.76923076923077,0.83199999999999996,1.5599999999999999E-2,0,0,3,0,4888,1,1,544,0,1600,6.8376068376068373,10.76923076923077,0.38834951456310679,5.6796116504854367E-2,0,0,3,0]
["MCS10-20 (39)",39,1482,0.97292307692307689,48750,31,6,6064,0,379440,1081.0256410256411,25.720797720797719,0.97675999052689022,9.0354932710030162E-4,0.54074087531792236,21088894.137398973,0,0.54026801629485421,21070452.635499313,21070452.635499313,0.16668165596753581,2.8569708629595229E-2,0.16668165596753581,2.8569708629595229E-2,14664,1,1,544,0,12480,35.555555555555557,9.9943019943019937,0.78058543907930944,2.195396547410558E-2,0,0,3,0,7332,1,1,544,0,1600,4.5584045584045585,9.9943019943019937,0.31323414252153486,6.8715740015661705E-2,0,0,3,0]
["MCS11-20 (52)",52,1976.0000000000002,0.96507692307692305,65000,41,8,8048,0,501840,1072.3076923076924,25.641025641025642,0.97664642690331616,9.1078935077066789E-4,0.54054225511696552,28108197.266082209,0,0.54006590507666685,28083427.063986678,28083427.063986678,0.12501520973176428,2.12577807136092E-2,0.12501520973176428,2.12577807136092E-2,19552,1,1,544,0,12480,26.666666666666668,9.6068376068376065,0.73515551366635246,2.756833176248822E-2,0,0,3,0,9776,1,1,544,0,1600,3.4188034188034186,9.6068376068376065,0.26246719160104987,7.6771653543307089E-2,0,0,3,0]
["MCS12-20 (78)",78,2964,0.64338461538461533,97500,41,8,8048,0,501840,714.87179487179492,19.90883190883191,0.97290506692308887,1.3609504164275633E-3,0.53019465805299448,41355183.328133568,0,0.5295075128332053,41301586.000990011,41301586.000990011,0.12501520973176428,1.4232750775322699E-2,0.12501520973176428,1.4232750775322699E-2,29328,1,1,544,0,12480,17.777777777777779,9.2193732193732192,0.65850569860700714,3.7040945546644152E-2,0,0,3,0,14664,1,1,544,0,1600,2.2792022792022792,9.2193732193732192,0.19821605550049554,8.6967294350842425E-2,0,0,3,0]
["MCS13-20 (104)",104,3952.0000000000005,0.48253846153846153,130000,41,8,8048,0,501840,536.15384615384619,17.042735042735043,0.96919226253012791,1.8076756689944997E-3,0.52023578757229394,54104521.907518566,0,0.51935404150336639,54012820.316350102,54012820.316350102,0.12501520973176428,1.0720235806179444E-2,0.12501520973176428,1.0720235806179444E-2,39104,1,1,544,0,12480,13.333333333333334,9.0256410256410255,0.59633027522935778,4.4724770642201837E-2,0,0,3,0,19552,1,1,544,0,1600,1.7094017094017093,9.0256410256410255,0.15923566878980891,9.3152866242038224E-2,0,0,3,0]
["MCS14-20 (117)",117,4446,0.42892307692307691,146250,41,8,8048,0,501840,476.58119658119659,16.087369420702753,0.96734646671035895,2.0297621342380201E-3,0.51539534322644076,60301255.157493569,0,0.51442194110454686,60187367.109231986,60187367.109231986,0.12501520973176428,9.5493974831316938E-3,0.12501520973176428,9.5493974831316938E-3,43992,1,1,544,0,12480,11.851851851851851,8.9610636277302937,0.56944697937579847,4.8047088884833E-2,0,0,3,0,21996,1,1,544,0,1600,1.5194681861348529,8.9610636277302937,0.14498006524102935,9.5415005436752451E-2,0,0,3,0]
["MCS15-20 (130)",130,4940,0.38603076923076923,162500,41,8,8048,0,501840,428.92307692307691,15.323076923076924,0.96550768804543563,2.2510042942235765E-3,0.51064414268954728,66383738.549641155,0,0.50958263588912001,66245742.665585592,66245742.665585592,0.12501520973176428,8.6127268246934934E-3,0.12501520973176428,8.6127268246934934E-3,48880,1,1,544,0,12480,10.666666666666666,8.9094017094017097,0.54488298987076489,5.1082780300384212E-2,0,0,3,0,24440,1,1,544,0,1600,1.3675213675213675,8.9094017094017097,0.1330671989354624,9.7305389221556876E-2,0,0,3,0]
["MCS8-2-20 (Future)",156,5928,0.32169230769230767,195000,41,8,8048,0,501840,357.43589743589746,14.176638176638177,0.96185102272378786,2.6909748842344136E-3,0.50139977937782243,78218365.582940295,0,0.50017212906814956,78026852.134631321,78026852.134631321,0.12501520973176428,7.2077208370361894E-3,0.12501520973176428,7.2077208370361894E-3,58656,1,1,544,0,12480,8.8888888888888893,8.8319088319088319,0.50160771704180063,5.6430868167202573E-2,0,0,3,0,29328,1,1,544,0,1600,1.1396011396011396,8.8319088319088319,0.11428571428571428,0.10028571428571428,0,0,3,0]
["MCS9-2-20 (Future)",0,0,{"$error":"#DIV/0!"},0,0,1,432,0,0,{"$error":"#DIV/0!"},{"$error":"#DIV/0!"},0,{"$error":"#DIV/0!"},{"$error":"#DIV/0!"},{"$error":"#DIV/0!"},{"$error":"#DIV/0!"},{"$error":"#DIV/0!"},{"$error":"#DIV/0!"},{"$error":"#DIV/0!"},1.0000105806829664,{"$error":"#DIV/0!"},1.0000105806829664,{"$error":"#DIV/0!"},0,1,1,544,0,12480,{"$error":"#DIV/0!"},{"$error":"#DIV/0!"},0.95823095823095827,{"$error":"#DIV/0!"},{"$error":"#DIV/0!"},{"$error":"#DIV/0!"},3,{"$error":"#DIV/0!"},0,1,1,544,0,1600,{"$error":"#DIV/0!"},{"$error":"#DIV/0!"},0.74626865671641796,{"$error":"#DIV/0!"},{"$error":"#DIV/0!"},{"$error":"#DIV/0!"},3,{"$error":"#DIV/0!"}]
["MCS16-20 (21.7)",21.7,{"$f":"$G$13*$B75*1000000","v":954.8},0.95889400921658985,27125,17,4,3632,0,208080,1065.4377880184331,28.374807987711215,0.9740588030423889,9.1423339212888587E-4,0.53904570797598805,11697291.863078941,0,0.53856893896758451,11686945.975596583,11686945.975596583,0.25001454843907889,4.2352856697480283E-2,0.25001454843907889,4.2352856697480283E-2,8159.2,1,1,544,0,12480,63.901689708141319,12.563236047107013,0.83569936251138366,1.3077891466223818E-2,0,0,3,0,4079.6,1,1,544,0,1600,8.1925243215565793,12.563236047107013,0.39471087428458657,4.8179396092362346E-2,0,0,3,0]
["MCS17-20 (43.3)",43.3,1905.1999999999998,0.96110854503464205,54125,34,7,6832,0,416160,1067.8983833718246,27.309212214523992,0.97506480750811142,9.130689049546112E-4,0.5396242214703354,23365728.78966552,0,0.5391475289440375,23345088.003276821,23345088.003276821,0.14287225811852353,2.423362359881372E-2,0.14287225811852353,2.423362359881372E-2,16280.8,1,1,544,0,12480,32.024634334103155,11.173723376956632,0.74133916266692002,2.3149028180392533E-2,0,0,3,0,8140.4,1,1,544,0,1600,4.1057223505260456,11.173723376956632,0.26870885395673788,6.5447400241837969E-2,0,0,3,0]
["MCS18-20 (65)",65,2860,0.77206153846153847,81250,41,8,8048,0,501840,857.84615384615381,23.535042735042737,0.97329754387053735,1.1345828613985819E-3,0.53454025709764652,34745116.711347021,0,0.5339580903457527,34707275.872473925,34707275.872473925,0.12501520973176428,1.7068554406931377E-2,0.12501520973176428,1.7068554406931377E-2,24440,1,1,544,0,12480,21.333333333333332,10.707692307692307,0.66581306017925734,3.1209987195902688E-2,0,0,3,0,12220,1,1,544,0,1600,2.7350427350427351,10.707692307692307,0.20345879959308241,7.4389623601220756E-2,0,0,3,0]
["MCS19-20 (86.7)",86.7,3814.8,0.57882352941176474,108375,41,8,8048,0,501840,643.13725490196077,20.091759579648851,0.96970615105650515,1.5077748080451756E-3,0.5258152441088908,45588181.664240837,0,0.52506412109970257,45523059.299344212,45523059.299344212,0.12501520973176428,1.2848674831545431E-2,0.12501520973176428,1.2848674831545431E-2,32599.199999999997,1,1,544,0,12480,15.993848519800075,10.474945533769063,0.60425301158151612,3.7780338536623159E-2,0,0,3,0,16299.599999999999,1,1,544,0,1600,2.0504933999743686,10.474945533769063,0.16370631087828436,7.9837521486453317E-2,0,0,3,0]
["MCS20-20 (130)",130,5720,0.38603076923076923,162500,41,8,8048,0,501840,428.92307692307691,16.656410256410258,0.96261854341220887,2.2442684835650493E-3,0.50922978032911281,66199871.442784667,0,0.50817413954803392,66062638.141244404,66062638.141244404,0.12501520973176428,8.638518480987567E-3,0.12501520973176428,8.638518480987567E-3,48880,1,1,544,0,12480,10.666666666666666,10.242735042735042,0.51013734466971872,4.782537606278614E-2,0,0,3,0,24440,1,1,544,0,1600,1.3675213675213675,10.242735042735042,0.11778563015312132,8.6130742049469966E-2,0,0,3,0]
["MCS21-20 (173.3)",173.3,7625.2000000000007,0.2895787651471437,216625,41,8,8048,0,501840,321.75418349682633,14.937744438032956,0.95563379101585411,2.9700741747318419E-3,0.49365861319308779,85551037.666362122,0,0.49233690942096037,85321986.402652442,85321986.402652442,0.12501520973176428,6.532225603934092E-3,0.12501520973176428,6.532225603934092E-3,65160.799999999996,1,1,544,0,12480,8.001538757453357,10.126562800538565,0.4413886766827943,5.5162974280621335E-2,0,0,3,0,32580.399999999998,1,1,544,0,1600,1.0258383022376099,10.126562800538565,9.1983626914409228E-2,8.9666789311502557E-2,0,0,3,0]
["MCS22-20 (195)",195,8579.9999999999982,0.25735384615384616,243750,41,8,8048,0,501840,285.94871794871796,14.363532763532762,0.95217133923285924,3.3298674883502073E-3,0.48620784297117003,94810529.379378155,0,0.4847656119626973,94529294.332725972,94529294.332725972,0.12501520973176428,5.8285065056729616E-3,0.12501520973176428,5.8285065056729616E-3,73320,1,1,544,0,12480,7.1111111111111107,10.087749287749286,0.41346408693347475,5.8143387225019882E-2,0,0,3,0,36660,1,1,544,0,1600,0.9116809116809117,10.087749287749286,8.2884376295068396E-2,9.0913800248653143E-2,0,0,3,0]
["MCS23-20 (216.7)",216.7,9534.7999999999993,0.23158283341024458,270875,41,8,8048,0,501840,257.31425934471622,13.904322411936624,0.94873388717734664,3.6870630084528512E-3,0.47897863705731414,103794670.65031998,0,0.47742365478896104,103457705.99276786,103457705.99276786,0.12501520973176428,5.2657260731457179E-3,0.12501520973176428,5.2657260731457179E-3,81479.199999999997,1,1,544,0,12480,6.3990155360713734,10.056709224221914,0.38886257696238502,6.0769125308472727E-2,0,0,3,0,40739.599999999999,1,1,544,0,1600,0.82038660718863765,10.056709224221914,7.5423313346155305E-2,9.1936305011879174E-2,0,0,3,0]
["MCS8-3-20 (Future)",234,10296,0.21446153846153845,292500,41,8,8048,0,501840,238.2905982905983,13.599240265906932,0.94601115970441862,3.9699894435228471E-3,0.47336746725161388,110767987.33687766,0,0.47172781329765334,110384308.31165089,110384308.31165089,0.12501520973176428,4.8918358472347621E-3,0.12501520973176428,4.8918358472347621E-3,87984,1,1,544,0,12480,5.9259259259259256,10.036087369420702,0.37125178486435029,6.2648738695859116E-2,0,0,3,0,43992,1,1,544,0,1600,0.75973409306742645,10.036087369420702,7.0372976776917659E-2,9.262843068261789E-2,0,0,3,0]
["MCS9-3-20 (Future)",0,0,{"$error":"#DIV/0!"},0,0,1,432,0,0,{"$error":"#DIV/0!"},{"$error":"#DIV/0!"},0,{"$error":"#DIV/0!"},{"$error":"#DIV/0!"},{"$error":"#DIV/0!"},{"$error":"#DIV/0!"},{"$error":"#DIV/0!"},{"$error":"#DIV/0!"},{"$error":"#DIV/0!"},1.0000105806829664,{"$error":"#DIV/0!"},1.0000105806829664,{"$error":"#DIV/0!"},0,1,1,544,0,12480,{"$error":"#DIV/0!"},{"$error":"#DIV/0!"},0.95823095823095827,{"$error":"#DIV/0!"},{"$error":"#DIV/0!"},{"$error":"#DIV/0!"},3,{"$error":"#DIV/0!"},0,1,1,544,0,1600,{"$error":"#DIV/0!"},{"$error":"#DIV/0!"},0.74626865671641796,{"$error":"#DIV/0!"},{"$error":"#DIV/0!"},{"$error":"#DIV/0!"},3,{"$error":"#DIV/0!"}]
["MCS0-40 (13.5)",13.5,{"$f":"$G$11*$B85*1000000","v":432},0.90666666666666662,16875,10,2,1984,0,122400,1007.4074074074074,23.440329218106996,0.97726111394992332,9.7007537046499737E-4,0.53977271150117556,7286931.6052658707,0,0.5392671442155299,7280106.446909654,7280106.446909654,0.50001322585370811,7.9831584659477636E-2,0.50001322585370811,7.9831584659477636E-2,5076,1,1,544,0,12480,102.71604938271605,11.588477366255145,0.89861751152073732,8.7485599078341008E-3,0,0,3,0,2538,1,1,544,0,1600,13.168724279835391,11.588477366255145,0.53191489361702127,4.0392287234042548E-2,0,0,3,0]
["MCS1-40 (27)",27,864,0.95199999999999996,33750,21,5,4512,0,257040,1057.7777777777778,25.679012345679013,0.97629899726526892,9.22971741112124E-4,0.54012177891000346,14583288.030570094,0,0.5396396420736127,14570270.335987542,14570270.335987542,0.20001481295615306,3.3562326268810311E-2,0.20001481295615306,3.3562326268810311E-2,10152,1,1,544,0,12480,51.358024691358025,9.3497942386831276,0.84598698481561818,1.6472342733188719E-2,0,0,3,0,5076,1,1,544,0,1600,6.5843621399176957,9.3497942386831276,0.41322314049586778,6.275826446280991E-2,0,0,3,0]
["MCS2-40 (40.5)",40.5,1295.9999999999998,0.96711111111111114,50625,32,7,6608,0,391680,1074.5679012345679,25.240054869684499,0.97705048892436641,9.0924965076830979E-4,0.54079476604235566,21902188.024715405,0,0.54031897303827592,21882918.408050172,21882918.408050172,0.14287225811852353,2.4335322771177226E-2,0.14287225811852353,2.4335322771177226E-2,15228,1,1,544,0,12480,34.238683127572017,8.6035665294924542,0.79918032786885251,2.3341444672131149E-2,0,0,3,0,7614,1,1,544,0,1600,4.3895747599451305,8.6035665294924542,0.33783783783783783,7.6963682432432443E-2,0,0,3,0]
["MCS3-40 (54)",54,1728,0.92933333333333334,67500,41,8,8048,0,501840,1032.5925925925926,23.670781893004115,0.97759007605036774,9.46733574367286E-4,0.5403909372168707,29181110.609711021,0,0.53989655956597737,29154414.216562778,29154414.216562778,0.12501520973176428,2.0451430175283298E-2,0.12501520973176428,2.0451430175283298E-2,20304,1,1,544,0,12480,25.679012345679013,8.2304526748971192,0.75728155339805825,2.9490291262135919E-2,0,0,3,0,10152,1,1,544,0,1600,3.2921810699588478,8.2304526748971192,0.2857142857142857,8.6785714285714299E-2,0,0,3,0]
["MCS4-40 (81)",81,2591.9999999999995,0.61955555555555553,101250,41,8,8048,0,501840,688.39506172839504,18.150891632373114,0.97431038767395628,1.4153361083499006E-3,0.52997631686495195,42928081.666061111,0,0.52926336572360477,42870332.623611987,42870332.623611987,0.12501520973176428,1.3686586531007402E-2,0.12501520973176428,1.3686586531007402E-2,30456,1,1,544,0,12480,17.119341563786008,7.8573388203017824,0.68541300527240778,4.0037346221441124E-2,0,0,3,0,15228,1,1,544,0,1600,2.1947873799725652,7.8573388203017824,0.21834061135371183,9.9481441048034941E-2,0,0,3,0]
["MCS5-40 (108)",108,3456,0.46466666666666667,135000,41,8,8048,0,501840,516.2962962962963,15.390946502057613,0.97105263157894739,1.8808049535603713E-3,0.51995553537534733,56155197.820537508,0,0.51904092102090871,56056419.470258139,56056419.470258139,0.12501520973176428,1.0304164708869454E-2,0.12501520973176428,1.0304164708869454E-2,40608,1,1,544,0,12480,12.839506172839506,7.6707818930041149,0.6260032102728732,4.8756019261637237E-2,0,0,3,0,20304,1,1,544,0,1600,1.6460905349794239,7.6707818930041149,0.17667844522968199,0.10733215547703182,0,0,3,0]
["MCS6-40 (121.5)",121.5,3888,0.41303703703703704,151875,41,8,8048,0,501840,458.93004115226336,14.470964791952447,0.96943190950114355,2.1123740495765596E-3,0.51508591830805062,62582939.074428149,0,0.51407636316956451,62460278.125102088,62460278.125102088,0.12501520973176428,9.1766907681568068E-3,0.12501520973176428,9.1766907681568068E-3,45684,1,1,544,0,12480,11.41289437585734,7.6085962505715594,0.6,5.2572115384615377E-2,0,0,3,0,22842,1,1,544,0,1600,1.4631915866483767,7.6085962505715594,0.16129032258064516,0.11023185483870968,0,0,3,0]
["MCS7-40 (135)",135,4320,0.37173333333333336,{"$f":"($B92*1000000/8)*$B$19","v":168750},41,8,8048,0,501840,413.03703703703701,13.734979423868312,0.96781658849666752,2.343171439150827E-3,0.51030666722367879,68891400.075196639,0,0.50920587622264069,68742793.290056497,68742793.290056497,0.12501520973176428,8.2747116155866864E-3,0.12501520973176428,8.2747116155866864E-3,50760,1,1,544,0,12480,10.271604938271604,7.5588477366255145,0.5760709010339734,5.6083825701624825E-2,0,0,3,0,25380,1,1,544,0,1600,1.3168724279835391,7.5588477366255145,0.14836795252225518,0.11266691394658754,0,0,3,0]
["MCS8-1-40 (Future)",162,5183.9999999999991,0.30977777777777776,202500,41,8,8048,0,501840,344.19753086419752,12.631001371742112,0.9646020420715955,2.8024664780415794E-3,0.50100938473099743,81163520.326421589,0,0.49973661891495785,80957332.264223173,80957332.264223173,0.12501520973176428,6.9217428867315066E-3,0.12501520973176428,6.9217428867315066E-3,60912,1,1,544,0,12480,8.5596707818930042,7.4842249657064457,0.53351573187414503,6.2329001367989065E-2,0,0,3,0,30456,1,1,544,0,1600,1.0973936899862826,7.4842249657064457,0.12787723785166241,0.11652813299232738,0,0,3,0]
["MCS9-1-40 (Future)",180,5759.9999999999991,0.27879999999999999,225000,41,8,8048,0,501840,309.77777777777777,12.079012345679013,0.96247084816496875,3.1069718914938016E-3,0.49499714595433353,89099486.271780044,0,0.49361704200709222,88851067.5612766,88851067.5612766,0.12501520973176428,6.2452585223039163E-3,0.12501520973176428,6.2452585223039163E-3,67680,1,1,544,0,12480,7.7037037037037033,7.4469135802469122,0.50847457627118642,6.6003911342894392E-2,0,0,3,0,33840,1,1,544,0,1600,0.98765432098765427,7.4469135802469122,0.11709601873536302,0.11855971896955507,0,0,3,0]
["MCS8-40 (27)",27,{"$f":"$G$12*$B95*1000000","v":1026},0.95199999999999996,33750,21,5,4512,0,257040,1057.7777777777778,27.012345679012345,0.97509901215459549,9.218373014066555E-4,0.53947912101653384,14565936.267446414,0,0.5389981303170206,14552949.518559556,14552949.518559556,0.20001481295615306,3.3603590954287839E-2,0.20001481295615306,3.3603590954287839E-2,10152,1,1,544,0,12480,51.358024691358025,10.683127572016462,0.82780578402759353,1.6118333775537279E-2,0,0,3,0,5076,1,1,544,0,1600,6.5843621399176957,10.683127572016462,0.38131553860819828,5.7912297426120113E-2,0,0,3,0]
["MCS9-40 (54)",54,2052,0.92933333333333334,67500,41,8,8048,0,501840,1032.5925925925926,25.004115226337447,0.97635760867873433,9.455400084048E-4,0.53973196796875922,29145526.270312998,0,0.53923879475101466,29118894.91655479,29118894.91655479,0.12501520973176428,2.047722183157737E-2,0.12501520973176428,2.047722183157737E-2,20304,1,1,544,0,12480,25.679012345679013,9.5637860082304531,0.72863148061653438,2.8374591312470807E-2,0,0,3,0,10152,1,1,544,0,1600,3.2921810699588478,9.5637860082304531,0.25608194622279129,7.7784891165172843E-2,0,0,3,0]
["MCS10-40 (81)",81,3078,0.61955555555555553,101250,41,8,8048,0,501840,688.39506172839504,19.484224965706446,0.97247521529171932,1.4126702374216153E-3,0.52902614141796167,42851117.454854891,0,0.52831574272039239,42793575.160351783,42793575.160351783,0.12501520973176428,1.3712378187301474E-2,0.12501520973176428,1.3712378187301474E-2,30456,1,1,544,0,12480,17.119341563786008,9.1906721536351164,0.65067778936392073,3.800834202294056E-2,0,0,3,0,15228,1,1,544,0,1600,2.1947873799725652,9.1906721536351164,0.19277108433734941,8.7831325301204827E-2,0,0,3,0]
["MCS11-40 (108)",108,4104,0.46466666666666667,135000,41,8,8048,0,501840,516.2962962962963,16.724279835390945,0.96862357555356537,1.8761001822056144E-3,0.51873676418542314,56023570.532025702,0,0.51782642874834928,55925254.304821722,55925254.304821722,0.12501520973176428,1.0329956365163529E-2,0.12501520973176428,1.0329956365163529E-2,40608,1,1,544,0,12480,12.839506172839506,9.0041152263374489,0.58779201205727205,4.5779954785229844E-2,0,0,3,0,20304,1,1,544,0,1600,1.6460905349794239,9.0041152263374489,0.15455950540958269,9.3894899536321491E-2,0,0,3,0]
["MCS12-40 (162)",162,6156,0.30977777777777776,202500,41,8,8048,0,501840,344.19753086419752,13.964334705075446,0.96101110685561086,2.7920337035618539E-3,0.49931379946632382,80888835.51354447,0,0.49804962314376006,80684038.949289128,80684038.949289128,0.12501520973176428,6.9475345430255794E-3,0.12501520973176428,6.9475345430255794E-3,60912,1,1,544,0,12480,8.5596707818930042,8.8175582990397814,0.49257972844963688,5.754657404483738E-2,0,0,3,0,30456,1,1,544,0,1600,1.0973936899862826,8.8175582990397814,0.11068068622025456,0.10085777531820696,0,0,3,0]
["MCS13-40 (216)",216,8208,0.23233333333333334,270000,41,8,8048,0,501840,258.14814814814815,12.584362139917696,0.95351735878883692,3.6936827384933422E-3,0.48129284065074057,103959253.58055995,0,0.47972787589793425,103621221.1939538,103621221.1939538,0.12501520973176428,5.2563236319566062E-3,0.12501520973176428,5.2563236319566062E-3,81216,1,1,544,0,12480,6.4197530864197532,8.7242798353909468,0.42391304347826086,6.6032608695652167E-2,0,0,3,0,40608,1,1,544,0,1600,0.82304526748971196,8.7242798353909468,8.6206896551724144E-2,0.10474137931034481,0,0,3,0]
["MCS14-40 (243)",243,9234,0.20651851851851852,303750,41,8,8048,0,501840,229.46502057613168,12.124371284865113,0.94981414046589796,4.1392545934937812E-3,0.47276151643501285,114881048.49370812,0,0.47106337373856527,114468399.81847136,114468399.81847136,0.12501520973176428,4.692586661600281E-3,0.12501520973176428,4.692586661600281E-3,91368,1,1,544,0,12480,5.7064471879286698,8.6931870141746685,0.39629112155468055,6.9446208560904346E-2,0,0,3,0,45684,1,1,544,0,1600,0.73159579332418834,8.6931870141746685,7.7624684649718612E-2,0.10610324083058412,0,0,3,0]
["MCS15-40 (270)",270,10260,0.18586666666666668,337500,41,8,8048,0,501840,206.5185185185185,11.756378600823044,0.94613957557201245,4.5813788630639056E-3,0.46452737434337943,125422391.07271244,0,0.4627063030668388,124930701.82804649,124930701.82804649,0.12501520973176428,4.2415970853152225E-3,0.12501520973176428,4.2415970853152225E-3,101520,1,1,544,0,12480,5.1358024691358022,8.6683127572016456,0.37204865251609825,7.2442165513951828E-2,0,0,3,0,50760,1,1,544,0,1600,0.65843621399176955,8.6683127572016456,7.0596540769502295E-2,0.1072184962936816,0,0,3,0]
["MCS8-2-40 (Future)",324,12312,0.15488888888888888,405000,41,8,8048,0,501840,172.09876543209876,11.204389574759945,0.93887508605980785,5.4554434699314513E-3,0.4488906146817121,145440559.15687472,0,0.44685124966474576,144779804.89137763,144779804.89137763,0.12501520973176428,3.5651127208876318E-3,0.12501520973176428,3.5651127208876318E-3,121824,1,1,544,0,12480,4.2798353909465021,8.6310013717421121,0.33149171270718231,7.7454313642158948E-2,0,0,3,0,60912,1,1,544,0,1600,0.54869684499314131,8.6310013717421121,5.9772863120143453E-2,0.10893604303646144,0,0,3,0]
["MCS9-2-40 (Future)",360,13680.000000000002,0.1394,450000,41,8,8048,0,501840,154.88888888888889,10.928395061728395,0.93409375186133781,6.0307344094347494E-3,0.43903811531614506,158053721.51381224,0,0.43687138540452253,157273698.74562812,157273698.74562812,0.12501520973176428,3.2268705386738375E-3,0.12501520973176428,3.2268705386738375E-3,135360,1,1,544,0,12480,3.8518518518518516,8.6123456790123463,0.30903328050713152,8.0229793977812991E-2,0,0,3,0,67680,1,1,544,0,1600,0.49382716049382713,8.6123456790123463,5.4229934924078085E-2,0.10981561822125813,0,0,3,0]
["MCS16-40 (45)",45,{"$f":"$G$13*$B105*1000000","v":1980},0.95199999999999996,56250,35,7,6944,0,428400,1057.7777777777778,26.923456790123456,0.9751789193815672,9.2191284395316223E-4,0.53952191729352017,24278486.278208409,0,0.5390408503120937,24256838.264044218,24256838.264044218,0.14287225811852353,2.4001361754123509E-2,0.14287225811852353,2.4001361754123509E-2,16920,1,1,544,0,12480,30.814814814814813,11.120987654320988,0.73480923221855865,2.3845972680169573E-2,0,0,3,0,8460,1,1,544,0,1600,3.9506172839506171,11.120987654320988,0.26212319790301442,6.6349934469200525E-2,0,0,3,0]
["MCS17-40 (90)",90,3960,0.55759999999999998,112500,41,8,8048,0,501840,619.55555555555554,19.71358024691358,0.96916231498933969,1.5642863764175139E-3,0.52451328793610674,47206195.914249606,0,0.52373747127109249,47136372.41439832,47136372.41439832,0.12501520973176428,1.238520111474037E-2,0.12501520973176428,1.238520111474037E-2,33840,1,1,544,0,12480,15.407407407407407,10.449382716049383,0.59587471352177235,3.867456073338426E-2,0,0,3,0,16920,1,1,544,0,1600,1.9753086419753085,10.449382716049383,0.1589825119236884,8.0484896661367253E-2,0,0,3,0]
["MCS18-40 (135)",135,5940,0.37173333333333336,168750,41,8,8048,0,501840,413.03703703703701,16.401646090534978,0.96180678002483866,2.3286211496297204E-3,0.50738174023535032,68496534.931772292,0,0.50629351843324921,68349624.988488644,68349624.988488644,0.12501520973176428,8.3262949281748318E-3,0.12501520973176428,8.3262949281748318E-3,50760,1,1,544,0,12480,10.271604938271604,10.225514403292181,0.50112431737873431,4.8787343398650825E-2,0,0,3,0,25380,1,1,544,0,1600,1.3168724279835391,10.225514403292181,0.11409013120365089,8.6637193382772398E-2,0,0,3,0]
["MCS19-40 (189)",189,8316,0.26552380952380955,236250,41,8,8048,0,501840,295.02645502645504,14.509112286890065,0.95312618703942875,3.230646509154448E-3,0.48824537340563284,92278375.573664606,0,0.48683566664768563,92011940.99641259,92011940.99641259,0.12501520973176428,6.0069199644230964E-3,0.12501520973176428,6.0069199644230964E-3,71064,1,1,544,0,12480,7.3368606701940031,10.097589653145208,0.42082546533585108,5.7357701645535469E-2,0,0,3,0,35532,1,1,544,0,1600,0.94062316284538505,10.097589653145208,8.5215168299957386E-2,9.0594375798892207E-2,0,0,3,0]
["MCS20-40 (270)",270,11880,0.18586666666666668,337500,41,8,8048,0,501840,206.5185185185185,13.089711934156378,0.94039516685155755,4.5535633975954184E-3,0.46210244809400575,124767660.98538156,0,0.46030030302830455,124281081.81764223,124281081.81764223,0.12501520973176428,4.2673887416092944E-3,0.12501520973176428,4.2673887416092944E-3,101520,1,1,544,0,12480,5.1358024691358022,10.00164609053498,0.33927794693344931,6.6061331013484118E-2,0,0,3,0,50760,1,1,544,0,1600,0.65843621399176955,10.00164609053498,6.1766522544780732E-2,9.3807906114885722E-2,0,0,3,0]
["MCS21-40 (360)",360,15840,0.1394,{"$f":"($B110*1000000/8)*$B$19","v":450000},41,8,8048,0,501840,154.88888888888889,12.261728395061729,0.92664263767430866,5.9826282202788935E-3,0.4361538868247215,157015399.25689974,0,0.43401546241676425,156245566.47003514,156245566.47003514,0.12501520973176428,3.2526621949679102E-3,0.12501520973176428,3.2526621949679102E-3,135360,1,1,544,0,12480,3.8518518518518516,9.9456790123456784,0.27916964924838938,7.2476735862562647E-2,0,0,3,0,67680,1,1,544,0,1600,0.49382716049382713,9.9456790123456784,4.730368968779565E-2,9.5789971617786185E-2,0,0,3,0]
["MCS22-40 (405)",405,17820,0.12391111111111111,506250,41,8,8048,0,501840,137.67901234567901,11.985733882030178,0.91991611796278105,6.6816002111715614E-3,0.42424258369123125,171818246.39494866,0,0.42196751375231856,170896843.06968904,170896843.06968904,0.12501520973176428,2.9144200127541159E-3,0.12501520973176428,2.9144200127541159E-3,152280,1,1,544,0,12480,3.4238683127572016,9.9270233196159126,0.25645240835114252,7.4901364458326486E-2,0,0,3,0,76140,1,1,544,0,1600,0.43895747599451301,9.9270233196159126,4.2345966546686431E-2,9.6469405039170009E-2,0,0,3,0]
["MCS23-40 (450)",450,19799.999999999996,0.11151999999999999,562500,41,8,8048,0,501840,123.91111111111111,11.764938271604937,0.91328655038872553,7.3704976268817515E-3,0.41296457743291715,185834059.84481272,0,0.41057038317075156,184756672.42683822,184756672.42683822,0.12501520973176428,2.6438262669830803E-3,0.12501520973176428,2.6438262669830803E-3,169200,1,1,544,0,12480,3.0814814814814815,9.9120987654320967,0.2371541501976285,7.6961082395865021E-2,0,0,3,0,84600,1,1,544,0,1600,0.39506172839506171,9.9120987654320967,3.8328861632809512E-2,9.7019931008049079E-2,0,0,3,0]
["MCS8-3-40 (Future)",486,21384,0.10325925925925926,607500,41,8,8048,0,501840,114.73251028806584,11.617741197988112,0.90805130135201639,7.9145073970064567E-3,0.40436491263609586,196521347.54114261,0,0.40188657946387646,195316877.61944398,195316877.61944398,0.12501520973176428,2.4634304364690557E-3,0.12501520973176428,2.4634304364690557E-3,182736,1,1,544,0,12480,2.8532235939643349,9.9021490626428896,0.22368798394034986,7.839833667909378E-2,0,0,3,0,91368,1,1,544,0,1600,0.36579789666209417,9.9021490626428896,3.5625222657641613E-2,9.7390452440327749E-2,0,0,3,0]
["MCS9-3-40 (Future)",540,23760,9.293333333333334E-2,675000,41,8,8048,0,501840,103.25925925925925,11.433744855967078,0.9003100063149434,8.7189276077846035E-3,0.39211662881230985,211742979.55864733,0,0.38952844776247347,210345361.79173568,210345361.79173568,0.12501520973176428,2.2379356483265256E-3,0.12501520973176428,2.2379356483265256E-3,203040,1,1,544,0,12480,2.5679012345679011,9.8897119341563791,0.20613107822410148,8.0272198731501057E-2,0,0,3,0,101520,1,1,544,0,1600,0.32921810699588477,9.8897119341563791,3.2216494845360821E-2,9.7857603092783504E-2,0,0,3,0]
["MCS0-1-80 (29)",29.3,1289.1999999999998,0.96081911262798636,36625,23,5,4736,0,281520,1067.5767918088738,27.737580583996966,0.9746761466085756,9.1297989436161327E-4,0.53941079212597676,15804736.209291119,0,0.53893433308030025,15790775.959252799,15790775.959252799,0.20001481295615306,3.3929300820963772E-2,0.20001481295615306,3.3929300820963772E-2,11016.8,1,1,544,0,12480,47.326507394766786,11.840728100113765,0.79987694200892168,1.6901245962159667E-2,0,0,3,0,5508.4,1,1,544,0,1600,6.067500948047023,11.840728100113765,0.33881077418261901,5.5840250719972902E-2,0,0,3,0]
["MCS1-1-80 (59)",58.5,2574,0.85784615384615381,73125,41,8,8048,0,501840,953.16239316239319,25.063627730294396,0.97437849004729771,1.0222586382311141E-3,0.53721037799735705,31426807.112845387,0,0.53668112535547141,31395845.833295077,31395845.833295077,0.12501520973176428,1.8941895723807774E-2,0.12501520973176428,1.8941895723807774E-2,21996,1,1,544,0,12480,23.703703703703702,10.811016144349479,0.68677085626238166,2.8973145498569226E-2,0,0,3,0,10998,1,1,544,0,1600,3.0389363722697058,10.811016144349479,0.21941854086670323,7.2202413603949522E-2,0,0,3,0]
["MCS2-1-80 (88)",87.8,3863.2,0.57157175398633253,109750,41,8,8048,0,501840,635.07972665148066,19.962541128828143,0.9695248045649425,1.5266190430559892E-3,0.52538054114753574,46128411.512753636,0,0.52462115835087719,46061737.703207016,46061737.703207016,0.12501520973176428,1.2690312513730491E-2,0.12501520973176428,1.2690312513730491E-2,33012.799999999996,1,1,544,0,12480,15.793470007593013,10.466211085801062,0.60143418922044867,3.8081193615544767E-2,0,0,3,0,16506.399999999998,1,1,544,0,1600,2.0248038471273095,10.466211085801062,0.16210082671421625,8.0057545793483564E-2,0,0,3,0]
["MCS3-1-80 (117)",117,5148,0.42892307692307691,146250,41,8,8048,0,501840,476.58119658119659,17.420702754036089,0.96473555511126829,2.0242837149931562E-3,0.51409829029085075,60149499.964029536,0,0.51312977676230154,60036183.881189279,60036183.881189279,0.12501520973176428,9.5751891394257656E-3,0.12501520973176428,9.5751891394257656E-3,43992,1,1,544,0,12480,11.851851851851851,10.294396961063628,0.53516295025728988,4.5154373927958832E-2,0,0,3,0,21996,1,1,544,0,1600,1.5194681861348529,10.294396961063628,0.12861736334405144,8.4646302250803857E-2,0,0,3,0]
["MCS4-1-80 (175)",175.5,7722,0.28594871794871796,219375,41,8,{"$f":"($F119*$G$20+$G119*($G$14+$G$15))*8","v":8048},0,{"$f":"$B$8*$F119*8","v":501840},{"$f":"($J119)/($B119*1000000*$G$8)","v":317.72079772079775},{"$f":"($I119+$H119+2*$C119)/($B119*1000000*$G$8)","v":14.873061095283317},{"$f":"$J119/($J119+$I119+$H119+2*$C119)","v":0.95528161238987919},{"$f":"1/($K119+$L119)","v":3.0066700676905267E-3},{"$f":"$M119*$B$30/($N119*$F$31+1)","v":0.49289284967008029},{"$f":"$O119*$B119*1000000","v":86502695.117099091},{"$f":"MIN(($D$11*($D$13/1000)*(IF($AW119<>0,1/$AW119,0))+$C$11*($C$13/1000)*IF($AI119<>0,1/$AI119,0))/$B119,1)","v":0},{"$f":"$M119*$B$41/($N119*$F$42+1)","v":0.49155855622792699},{"$f":"$R119*$B119*1000000","v":86268526.618001193},{"$f":"$S119*(1-$Q119)+$P119*$Q119","v":86268526.618001193},{"$f":"($B$37/$G119)+$B$38","v":0.12501520973176428},{"$f":"IF(P119<>0,(($J119+$I119+$H119+2*$C119)/($B119*1000000))*($N119+1)*$U119/$B$31,0)","v":6.4529536112984303E-3},{"$f":"($B$48/$G119)+$B$49","v":0.12501520973176428},{"$f":"IF(S119<>0,(($J119+$I119+$H119+2*$C119)/($B119*1000000))*($N119+1)*$W119/$B$42,0)","v":6.4529536112984303E-3},65988,{"$f":"IF($C$14,MIN(INT($Y119/$C$9),INT($G$21/$C$9))+1,1)","v":1},{"$f":"IF($C$14,1,INT($Z119*$C$9/$G$21)+1)","v":1},{"$f":"($Z119*$G$20+$AA119*($G$14+$G$15))*8","v":544},0,{"$f":"$C$8*$Z119*8","v":12480},{"$f":"($AD119)/($B119*1000000*$G$8)","v":7.9012345679012341},{"$f":"($AC119+$AB119+2*$C119)/($B119*1000000*$G$8)","v":10.122190566635011},{"$f":"$AD119/($AD119+$AC119+$AB119+2*$C119)","v":0.43838696079808909},{"$f":"1/($AE119+$AF119)","v":5.5483349726008144E-2},{"$f":"$AG119*$C$30/($AH119*$F$31+1)","v":0},{"$f":"$AI119*$B119*1000000","v":0},{"$f":"($C$37/$AA119)+$C$38","v":3},{"$f":"IF(AJ119<>0,(($AD119+$AC119+$AB119+2*$C119)/($B119*1000000))*($AH119+1)*AK119/$C$31,0)","v":0},32994,{"$f":"IF($D$14,MIN(INT($AM119/$D$9),INT($G$21/$D$9))+1,1)","v":1},{"$f":"IF($D$14,1,INT($AN119*$D$9/$G$21)+1)","v":1},{"$f":"($AN119*$G$20+$AO119*($G$14+$G$15))*8","v":544},0,{"$f":"$D$8*$AN119*8","v":1600},{"$f":"($AR119)/($B119*1000000*$G$8)","v":1.0129787907565686},{"$f":"($AP119+$AQ119+2*$C119)/($B119*1000000*$G$8)","v":10.122190566635011},{"$f":"$AR119/($AR119+$AQ119+$AP119+2*$C119)","v":9.0971116670457125E-2},{"$f":"1/($AS119+$AT119)","v":8.98055492381169E-2},{"$f":"$AU119*$D$30/($AV119*$F$31+1)","v":0},{"$f":"$AW119*$B119*1000000","v":0},{"$f":"($D$37/$AO119)+$D$38","v":3},{"$f":"IF(AX119<>0,(($AR119+$AQ119+$AP119+2*$C119)/($B119*1000000))*($AV119+1)*$AY119/$D$31,0)","v":0}]
["MCS5-1-80 (234)",234,10296,{"$f":"($J120)/($E120*8)","v":0.21446153846153845},{"$f":"($B120*1000000/8)*$B$19","v":292500},{"$f":"IF($B$14,MIN(INT($E120/$B$9),INT($G$21/$B$9)),1)","v":41},{"$f":"INT($F120*$B$9/$G$19)+1","v":8},8048,0,501840,238.2905982905983,13.599240265906932,0.94601115970441862,3.9699894435228471E-3,0.47336746725161388,110767987.33687766,0,0.47172781329765334,110384308.31165089,110384308.31165089,0.12501520973176428,4.8918358472347621E-3,0.12501520973176428,4.8918358472347621E-3,{"$f":"($B120*1000000/8)*$C$19","v":87984},1,1,544,0,12480,5.9259259259259256,10.036087369420702,0.37125178486435029,6.2648738695859116E-2,0,0,3,0,{"$f":"($B120*1000000/8)*$D$19","v":43992},1,1,544,0,1600,0.75973409306742645,10.036087369420702,7.0372976776917659E-2,9.262843068261789E-2,0,0,3,0]
["MCS6-1-80 (264)",263.89999999999998,11611.599999999999,0.19016294050776814,329874.99999999994,41,8,8048,0,501840,211.29215611974234,13.166266683508063,0.94134206897172679,4.4551680775042797E-3,0.46397336245802923,122442570.3526739,0,0.46219751158287958,121973923.30672191,121973923.30672191,0.12501520973176428,4.3612096121589342E-3,0.12501520973176428,4.3612096121589342E-3,99226.39999999998,1,1,544,0,12480,5.2545155993431854,10.006820765441454,0.34430245646560287,6.5525061246110045E-2,0,0,3,0,49613.19999999999,1,1,544,0,1600,0.67365584606963924,10.006820765441454,6.3073575325617345E-2,9.3628780472421097E-2,0,0,3,0]
["MCS7-1-80 (292)",292.5,12870,0.17156923076923078,365625,41,8,8048,0,501840,190.63247863247864,12.834947768281102,0.93691890640519171,4.9147916091018392E-3,0.45533009027367788,133184051.40505078,0,0.45343507034435976,132629758.07572523,132629758.07572523,0.12501520973176428,3.9551651887965609E-3,0.12501520973176428,3.9551651887965609E-3,109980,1,1,544,0,12480,4.7407407407407405,9.9844254510921182,0.32194819936023117,6.7910948302548763E-2,0,0,3,0,54990,1,1,544,0,1600,0.6077872744539411,9.9844254510921182,5.7380576674795583E-2,9.44089800602496E-2,0,0,3,0]
["MCS8-1-80 (351)",351,15444,0.14297435897435898,438750,41,8,8048,0,501840,158.86039886039887,12.325419436530547,0.92799976330310519,5.8416053966892012E-3,0.43861686372716163,153954519.16823372,0,0.43650808415570236,153214337.53865153,153214337.53865153,0.12501520973176428,3.330718083171094E-3,0.12501520973176428,3.330718083171094E-3,131976,1,1,544,0,12480,3.9506172839506171,9.9499841722063938,0.28420477318272908,7.1939333211878301E-2,0,0,3,0,65988,1,1,544,0,1600,0.5064893953782843,9.9499841722063938,4.8437878420925166E-2,9.5634536207314116E-2,0,0,3,0]
["MCS9-1-80 (390)",390,17159.999999999996,0.12867692307692308,487500,41,8,8048,0,501840,142.97435897435898,12.070655270655269,0.92214741422397317,6.4497398053685352E-3,0.42814006595088366,166974625.72084466,0,0.42590848204474901,166104307.99745211,166104307.99745211,0.12501520973176428,3.0184945303583597E-3,0.12501520973176428,3.0184945303583597E-3,146640,1,1,544,0,12480,3.5555555555555554,9.9327635327635306,0.26360256843528224,7.4138222372423124E-2,0,0,3,0,73320,1,1,544,0,1600,0.45584045584045585,9.9327635327635306,4.3878894251864864E-2,9.6259324265028548E-2,0,0,3,0]
["MCS0-2-80 (59)",58.6,2578.3999999999996,0.856382252559727,73250,41,8,8048,0,501840,951.53583617747449,25.037542662116042,0.97436184192132413,1.0239885928369726E-3,0.53716909719104966,31478109.095395509,0,0.53663902217081572,31447046.699209802,31447046.699209802,0.12501520973176428,1.8909927441949817E-2,0.12501520973176428,1.8909927441949817E-2,22033.599999999999,1,1,544,0,12480,23.663253697383393,10.809252938945772,0.686438440552671,2.9008624482971045E-2,0,0,3,0,11016.8,1,1,544,0,1600,3.0337504740235115,10.809252938945772,0.21915406530791148,7.223865877712031E-2,0,0,3,0]
["MCS1-2-80 (117)",117,5148,0.42892307692307691,146250,41,8,8048,0,501840,476.58119658119659,17.420702754036089,0.96473555511126829,2.0242837149931562E-3,0.51409829029085075,60149499.964029536,0,0.51312977676230154,60036183.881189279,60036183.881189279,0.12501520973176428,9.5751891394257656E-3,0.12501520973176428,9.5751891394257656E-3,43992,1,1,544,0,12480,11.851851851851851,10.294396961063628,0.53516295025728988,4.5154373927958832E-2,0,0,3,0,21996,1,1,544,0,1600,1.5194681861348529,10.294396961063628,0.12861736334405144,8.4646302250803857E-2,0,0,3,0]
["MCS2-2-80 (176)",175.6,7726.4,0.28578587699316627,219500,41,8,8048,0,501840,317.53986332574033,14.870159453302961,0.95526561043802416,3.0083328764870347E-3,0.49285809868078756,86545882.128346294,0,0.49152323500857326,86311480.067505464,86311480.067505464,0.12501520973176428,6.449397534387123E-3,0.12501520973176428,6.449397534387123E-3,66025.599999999991,1,1,544,0,12480,7.8967350037965067,10.121994431789419,0.43825148893134064,5.5497808742555353E-2,0,0,3,0,33012.799999999996,1,1,544,0,1600,1.0124019235636548,10.121994431789419,9.092562284051646E-2,8.9811783960720148E-2,0,0,3,0]
["MCS3-2-80 (234)",234,10296,0.21446153846153845,292500,41,8,8048,0,501840,238.2905982905983,13.599240265906932,0.94601115970441862,3.9699894435228471E-3,0.47336746725161388,110767987.33687766,0,0.47172781329765334,110384308.31165089,110384308.31165089,0.12501520973176428,4.8918358472347621E-3,0.12501520973176428,4.8918358472347621E-3,87984,1,1,544,0,12480,5.9259259259259256,10.036087369420702,0.37125178486435029,6.2648738695859116E-2,0,0,3,0,43992,1,1,544,0,1600,0.75973409306742645,10.036087369420702,7.0372976776917659E-2,9.262843068261789E-2,0,0,3,0]
["MCS4-2-80 (351)",351,15444,0.14297435897435898,438750,41,8,8048,0,501840,158.86039886039887,12.325419436530547,0.92799976330310519,5.8416053966892012E-3,0.43861686372716163,153954519.16823372,0,0.43650808415570236,153214337.53865153,153214337.53865153,0.12501520973176428,3.330718083171094E-3,0.12501520973176428,3.330718083171094E-3,131976,1,1,544,0,12480,3.9506172839506171,9.9499841722063938,0.28420477318272908,7.1939333211878301E-2,0,0,3,0,65988,1,1,544,0,1600,0.5064893953782843,9.9499841722063938,4.8437878420925166E-2,9.5634536207314116E-2,0,0,3,0]
["MCS5-2-80 (468)",468,20592,0.10723076923076923,585000,41,8,8048,0,501840,119.14529914529915,11.688509021842355,0.91066140177690025,7.6432843621160205E-3,0.40861950365051369,191233927.70844039,0,0.40618207366110104,190093210.47339529,190093210.47339529,0.12501520973176428,2.5501592011392595E-3,0.12501520973176428,2.5501592011392595E-3,175968,1,1,544,0,12480,2.9629629629629628,9.9069325735992404,0.23022432113341204,7.7700708382526559E-2,0,0,3,0,87984,1,1,544,0,1600,0.37986704653371323,9.9069325735992404,3.6927621861152143E-2,9.7211964549483013E-2,0,0,3,0]
["MCS6-2-80 (528)",527.79999999999995,23223.199999999997,9.5081470253884068E-2,659749.99999999988,41,8,8048,{"$f":"$B$27*$B131*1000000","v":0},501840,105.64607805987117,11.472022230642919,0.90204740170659947,8.5383898604867864E-3,0.39481850439940352,208385206.62200516,0,0.3922535466436527,207031421.91851985,207031421.91851985,0.12501520973176428,2.284846083601346E-3,0.12501520973176428,2.284846083601346E-3,198452.79999999996,1,1,544,{"$f":"$C$27*$B131*1000000","v":0},12480,2.6272577996715927,9.8922992716096161,0.20985229626839572,7.9875030267158115E-2,0,0,3,0,99226.39999999998,1,1,544,{"$f":"$D$27*$B131*1000000","v":0},1600,0.33682792303481962,9.8922992716096161,3.2928315058118482E-2,9.7760051368171494E-2,0,0,3,0]
["MCS7-2-80 (585)",585,25740,8.578461538461539E-2,731250,41,8,8048,0,501840,95.316239316239319,11.30636277302944,0.89395904290946404,9.3788744638098366E-3,0.3824625801882901,223740609.41014972,0,0.37979607921527436,222180706.3409355,222180706.3409355,0.12501520973176428,2.0818238719201593E-3,0.12501520973176428,2.0818238719201593E-3,219960,1,1,544,0,12480,2.3703703703703702,9.8811016144349484,0.19347637355822894,8.1622845094877827E-2,0,0,3,0,109980,1,1,544,0,1600,0.30389363722697055,9.8811016144349484,2.9837386244964941E-2,9.8183649112337762E-2,0,0,3,0]
["MCS8-2-80 (702)",702,30888,7.1487179487179489E-2,{"$f":"($B133*1000000/8)*$B$19","v":877500},41,8,8048,0,501840,79.430199430199437,11.051598607154162,0.87785832237118311,1.1051946598001622E-2,0.35945295084020307,252335971.48982257,0,0.35662909585337771,250353625.28907114,250353625.28907114,0.12501520973176428,1.7696003191074257E-3,0.12501520973176428,1.7696003191074257E-3,263952,1,1,544,0,12480,1.9753086419753085,9.8638809749920853,0.16684491978609625,8.4465240641711237E-2,0,0,3,0,131976,1,1,544,0,1600,0.25324469768914215,9.8638809749920853,2.5031289111389236E-2,9.8842302878598257E-2,0,0,3,0]
["MCS9-2-80 (780)",780,34319.999999999993,6.4338461538461539E-2,{"$f":"($B134*1000000/8)*$B$19","v":975000},41,8,8048,0,501840,71.487179487179489,10.924216524216522,0.86744288954035065,1.2134244150672052E-2,0.34559199783417816,269561758.31065893,0,0.34269325101627107,267300735.79269147,267300735.79269147,0.12501520973176428,1.6134885427010587E-3,0.12501520973176428,1.6134885427010587E-3,293280,1,1,544,0,12480,1.7777777777777777,9.8552706552706528,0.15282131661442008,8.5961990595611312E-2,0,0,3,0,146640,1,1,544,0,1600,0.22792022792022792,9.8552706552706528,2.2603978300180835E-2,9.9174954792043427E-2,0,0,3,0]
["MCS0-3-80 (88)",87.9,3867.6,0.57092150170648459,109875,41,8,8048,0,501840,634.35722411831625,19.950954367336621,0.96950832188356317,1.5283318058386872E-3,0.52534105833466249,46177479.027616836,0,0.52458092606830176,46110663.401403725,46110663.401403725,0.12501520973176428,1.2676112479647797E-2,0.12501520973176428,1.2676112479647797E-2,33050.400000000001,1,1,544,0,12480,15.77550246492226,10.465427885223107,0.60117923619407299,3.8108404948167557E-2,0,0,3,0,16525.2,1,1,544,0,1600,2.0225003160156745,10.465427885223107,0.1619564337193295,8.0077334197100974E-2,0,0,3,0]
["MCS1-3-80 (176)",175.5,7722,0.28594871794871796,219375,41,8,8048,0,501840,317.72079772079775,14.873061095283317,0.95528161238987919,3.0066700676905267E-3,0.49289284967008029,86502695.117099091,0,0.49155855622792699,86268526.618001193,86268526.618001193,0.12501520973176428,6.4529536112984303E-3,0.12501520973176428,6.4529536112984303E-3,65988,1,1,544,0,12480,7.9012345679012341,10.122190566635011,0.43838696079808909,5.5483349726008144E-2,0,0,3,0,32994,1,1,544,0,1600,1.0129787907565686,10.122190566635011,9.0971116670457125E-2,8.98055492381169E-2,0,0,3,0]
["MCS2-3-80 (263)",263.39999999999998,11589.599999999999,0.19052391799544421,329249.99999999994,41,8,8048,0,501840,211.69324221716022,13.172698894794566,0.94141976846446385,4.4470940999558782E-3,0.46412738809240583,122251154.02353968,0,0.46235371420988436,121783968.32288353,121783968.32288353,0.12501520973176428,4.3690925412726679E-3,0.12501520973176428,4.3690925412726679E-3,99038.39999999998,1,1,544,0,12480,5.2644900025310051,10.007255547118872,0.34472090864895921,6.5480399522694133E-2,0,0,3,0,49519.19999999999,1,1,544,0,1600,0.67493461570910318,10.007255547118872,6.3183168004043735E-2,9.3613761293991279E-2,0,0,3,0]
["MCS3-3-80 (351)",351,15444,0.14297435897435898,438750,41,8,8048,0,501840,158.86039886039887,12.325419436530547,0.92799976330310519,5.8416053966892012E-3,0.43861686372716163,153954519.16823372,0,0.43650808415570236,153214337.53865153,153214337.53865153,0.12501520973176428,3.330718083171094E-3,0.12501520973176428,3.330718083171094E-3,131976,1,1,544,0,12480,3.9506172839506171,9.9499841722063938,0.28420477318272908,7.1939333211878301E-2,0,0,3,0,65988,1,1,544,0,1600,0.5064893953782843,9.9499841722063938,4.8437878420925166E-2,9.5634536207314116E-2,0,0,3,0]
["MCS4-3-80 (526)",526.5,23166,9.531623931623931E-2,658125,41,8,8048,0,501840,105.90693257359924,11.476205550279625,0.90223292941641797,8.5191111430728845E-3,0.39510860598197772,208024681.04951125,0,0.39254617563977023,206675561.47433901,206675561.47433901,0.12501520973176428,2.2899729071286486E-3,0.12501520973176428,2.2899729071286486E-3,197964,1,1,544,0,12480,2.6337448559670782,9.8925820407301881,0.21025675584608128,7.9831861985308991E-2,0,0,3,0,98982,1,1,544,0,1600,0.33765959691885616,9.8925820407301881,3.300602359930687E-2,9.7749401765822266E-2,0,0,3,0]
["MCS5-3-80 (702)",702,30888,7.1487179487179489E-2,877500,41,8,8048,0,501840,79.430199430199437,11.051598607154162,0.87785832237118311,1.1051946598001622E-2,0.35945295084020307,252335971.48982257,0,0.35662909585337771,250353625.28907114,250353625.28907114,0.12501520973176428,1.7696003191074257E-3,0.12501520973176428,1.7696003191074257E-3,263952,1,1,544,0,12480,1.9753086419753085,9.8638809749920853,0.16684491978609625,8.4465240641711237E-2,0,0,3,0,131976,1,1,544,0,1600,0.25324469768914215,9.8638809749920853,2.5031289111389236E-2,9.8842302878598257E-2,0,0,3,0]
["MCS6-3-80 (792)",791.69999999999993,34834.799999999996,6.3387646835922712E-2,989624.99999999988,41,8,8048,0,501840,70.430718706580777,10.907274079687873,0.86590185341370729,1.2294377642532857E-2,0.343604525135279,272031702.54960036,0,0.34069626437157396,269729232.50297511,269729232.50297511,0.12501520973176428,1.592724907415483E-3,0.12501520973176428,1.592724907415483E-3,297679.19999999995,1,1,544,0,12480,1.751505199781062,9.8541254403323375,0.15091857169115871,8.6165072024920908E-2,0,0,3,0,148839.59999999998,1,1,544,0,1600,0.22455194868987974,9.8541254403323375,2.2279902414027428E-2,9.9219367919168508E-2,0,0,3,0]
["MCS7-3-80 (877)",877.5,38610,5.7189743589743589E-2,1096875,41,8,8048,0,501840,63.544159544159541,10.796834441278886,0.85476607370364566,1.3451528509235098E-2,0.32969994760493793,289311704.02333307,0,0.32673370686097847,286708827.77050859,286708827.77050859,0.12501520973176428,1.457376766294692E-3,0.12501520973176428,1.457376766294692E-3,329940,1,1,544,0,12480,1.5802469135802468,9.8466603355492239,0.13829174238730552,8.7512743229466783E-2,0,0,3,0,164970,1,1,544,0,1600,0.2025957581513137,9.8466603355492239,2.0160274179728845E-2,9.950985333400536E-2,0,0,3,0]
["MCS8-3-80 (1053)",1053,46332,4.7658119658119655E-2,1316250,41,8,8048,0,501840,52.953466286799618,10.626991664028701,0.83285757909690783,1.5728103134667215E-2,0.30449590459110898,320634187.53443772,0,0.30146278187045727,317440309.30959147,317440309.30959147,0.12501520973176428,1.249227731086203E-3,0.12501520973176428,1.249227731086203E-3,395928,1,1,544,0,12480,1.3168724279835391,9.8351799092539824,0.1180834153357051,8.9669593520551066E-2,0,0,3,0,197964,1,1,544,0,1600,0.16882979845942808,9.8351799092539824,1.6876212977807781E-2,9.9959918994177707E-2,0,0,3,0]
["MCS9-3-80 (1170)",1170,51480,4.2892307692307695E-2,1462500,41,8,8048,0,501840,47.658119658119659,10.542070275403608,0.81886536302639479,1.7182074511134897E-2,0.28973021081637279,338984346.6551562,0,0.28668073908065522,335416464.72436661,335416464.72436661,0.12501520973176428,1.1451532134819586E-3,0.12501520973176428,1.1451532134819586E-3,439920,1,1,544,0,12480,1.1851851851851851,9.8294396961063626,0.10760104842047179,9.0788384604773079E-2,0,0,3,0,219960,1,1,544,0,1600,0.15194681861348527,9.8294396961063626,1.5223017202009439E-2,0.10018648196072462,0,0,3,0]
[]
[]
[]
[]
["For indoor, 3600/2600/1600 to 3SS device and outdoor 1550 (ignore BF gain)"]
["MCS",0,1,2,3,4,5,6,7,8,9,0,1,2,3,4,5,6,7,8,9,0,1,2,3,4,5,6,7,8,9]
["Rate (20MHz)",6.5,13,19.5,26,39,52,58.5,65,78,0,13,26,39,52,78,104,117,130,156,0,21.7,43.3,65,86.7,130,173.3,195,216.7,234,0]
["Rate (40MHz)",13.5,27,40.5,54,81,108,121.5,135,162,180,27,54,81,108,162,216,243,270,324,360,45,90,135,189,270,360,405,450,486,540]
["Rate (80Mhz)",29.3,58.5,87.8,117,175.5,234,263.89999999999998,292.5,351,390,58.6,117,175.6,234,351,468,527.79999999999995,585,702,780,87.9,175.5,263.39999999999998,351,526.5,702,791.69999999999993,877.5,1053,1170]
["Rate (80, 40 & 20MHz)",{"$f":"\" \"&B151&\"/\"&B152&\"/\"&B153","v":" 6.5/13.5/29.3"},{"$f":"\" \"&C151&\"/\"&C152&\"/\"&C153","v":" 13/27/58.5"}," 19.5/40.5/87.8"," 26/54/117"," 39/81/175.5"," 52/108/234"," 58.5/121.5/263.9"," 65/135/292.5"," 78/162/351"," 0/180/390"," 13/27/58.6"," 26/54/117"," 39/81/175.6"," 52/108/234"," 78/162/351"," 104/216/468"," 117/243/527.8"," 130/270/585"," 156/324/702"," 0/360/780"," 21.7/45/87.9"," 43.3/90/175.5"," 65/135/263.4"," 86.7/189/351"," 130/270/526.5"," 173.3/360/702"," 195/405/791.7"," 216.7/450/877.5"," 234/486/1053"," 0/540/1170"]
["4x4:3 1% (BF)",1.3929,4.5,4,5.7,9,12,13.5,13.5,-1000,-1000,4.5,6,8.7857000000000003,12,15,18.75,19.405999999999999,20.928999999999998,-1000,-1000,9.75,12.75,18,19,24,26.5,28,30.75,-1000,-1000]
["4x4:3 10% (BF)",0.42857000000000001,0.85714000000000001,2.125,4.2,6.8250000000000002,10.071,11.609,12.824999999999999,-1000,-1000,2.6911999999999998,5.2895000000000003,7.3977000000000004,10.35,13.5,17.25,18.562999999999999,20.286000000000001,-1000,-1000,8.6842000000000006,11.625,16,17.724,22.05,23.94,26.382000000000001,28.286000000000001,-1000,-1000]
["3x4:3 1% (BF)",3,4.5,5.25,5.5,7.2857000000000003,10.25,12,15,-1000,-1000,4.5,4.5,7.2,10,13,16.5,18.75,19.5,-1000,-1000,7,10.199999999999999,13.5,16.5,19.399999999999999,22.35,24,25.5,-1000,-1000]
["3x4:3 10% (BF)",1.5,1.5,1.5,3.5455000000000001,5.8448000000000002,8.8461999999999996,10.388999999999999,11.722,-1000,-1000,1.6667000000000001,3.7059000000000002,5.8170999999999999,8.7614000000000001,11.715999999999999,15.656000000000001,16.471,17.875,-1000,-1000,5.8278999999999996,8.8294999999999995,12.273,14.76,18.5,21,22.65,24.824999999999999,-1000,-1000]
["4x3:3 1% (BF)",6.5,6.5625,6.8,7.2691999999999997,8.7187999999999999,11.792999999999999,13.2,14.718999999999999,-1000,-1000,6.6,7,8.8675999999999995,11.769,14.875,18.25,20.318000000000001,21.818000000000001,-1000,-1000,13.5,17.75,24,24.5,28.5,29.5,30.75,33.299999999999997,-1000,-1000]
["4x3:3 10% (BF)",2.9754,2.7955000000000001,3.5,4.4103000000000003,6.9482999999999997,10.214,11.643000000000001,13.015000000000001,-1000,-1000,3.1974,5.4166999999999996,7.4009,10.319000000000001,13.417,17.029,18.759,20.114000000000001,-1000,-1000,10.298999999999999,13.462,18.221,19.809000000000001,23.5,25.065999999999999,26.837,29.239000000000001,-1000,-1000]
["3x3:3 1% (BF)",4.375,5.5,5.8333000000000004,7.1052999999999997,10,12.875,14.464,16.125,-1000,-1000,5.8125,8.4642999999999997,11.063000000000001,13.406000000000001,17.318000000000001,20.6,22.227,23.687999999999999,-1000,-1000,18,22.5,30.75,30.75,34.5,35.4,37.313000000000002,40.5,-1000,-1000]
["3x3:3 10% (BF)",1.7561,2.1509,3.3191000000000002,5.3162000000000003,8.1715999999999998,11.337,12.789,14.27,-1000,-1000,4.3022,6.9856999999999996,9.4839000000000002,12,15.651999999999999,19.082000000000001,20.672999999999998,22.207000000000001,-1000,-1000,13.544,17.875,24.968,25.193000000000001,30.227,30.856999999999999,33.29,35.594999999999999,-1000,-1000]
["4x2:2 1% (BF)",8.1999999999999993,8.5,10.199999999999999,9.3000000000000007,11.25,13.44,14.813000000000001,16.350000000000001,-1000,-1000,9.75,11.727,15.3,16.5,19.167000000000002,21.75,23.7,25.5,-1000,-1000,-1000,-1000,-1000,-1000,-1000,-1000,-1000,-1000,-1000,-1000]
["4x2:2 10% (BF)",4.9467999999999996,5.3182,5.4286000000000003,6.4687999999999999,8.6714000000000002,11.76,13.179,14.791,-1000,-1000,7.0929000000000002,8.9405000000000001,11.728999999999999,13.542999999999999,16.760999999999999,19.788,21.934999999999999,23.417999999999999,-1000,-1000,-1000,-1000,-1000,-1000,-1000,-1000,-1000,-1000,-1000,-1000]
["3x2:2 1% (BF)",7.25,7.5,9.25,9.3000000000000007,11.727,15,16.385000000000002,17.832999999999998,-1000,-1000,11.4,15,18.5,21.375,23.1,24.832999999999998,26.719000000000001,30,-1000,-1000,-1000,-1000,-1000,-1000,-1000,-1000,-1000,-1000,-1000,-1000]
["3x2:2 10% (BF)",3.8769,4.6124999999999998,5.306,7.0532000000000004,9.9872999999999994,13.103,14.715999999999999,16.190999999999999,-1000,-1000,8.9091000000000005,11.615,14.81,16.236999999999998,19.452000000000002,22.439,24.268999999999998,26.385999999999999,-1000,-1000,-1000,-1000,-1000,-1000,-1000,-1000,-1000,-1000,-1000,-1000]
["4x1:1 1% (BF)",15.3,15.4,15.5,15.6,16.5,17.75,19.125,19.928999999999998,-1000,-1000,-1000,-1000,-1000,-1000,-1000,-1000,-1000,-1000,-1000,-1000,-1000,-1000,-1000,-1000,-1000,-1000,-1000,-1000,-1000,-1000]
["4x1:1 10% (BF)",10.199999999999999,10.432,10.641,11.468999999999999,11.964,14.782,16.338999999999999,17.888999999999999,-1000,-1000,-1000,-1000,-1000,-1000,-1000,-1000,-1000,-1000,-1000,-1000,-1000,-1000,-1000,-1000,-1000,-1000,-1000,-1000,-1000,-1000]
["3x1:1 1% (BF)",14,14.2,14.5,15,15.9,18.643000000000001,20.25,22.125,-1000,-1000,-1000,-1000,-1000,-1000,-1000,-1000,-1000,-1000,-1000,-1000,-1000,-1000,-1000,-1000,-1000,-1000,-1000,-1000,-1000,-1000]
["3x1:1 10% (BF)",9.7826000000000004,10.038,10.265000000000001,10.6,13.196999999999999,16.288,17.908999999999999,19.63,-1000,-1000,-1000,-1000,-1000,-1000,-1000,-1000,-1000,-1000,-1000,-1000,-1000,-1000,-1000,-1000,-1000,-1000,-1000,-1000,-1000,-1000]
["3x4:3 1%",2.8635999999999999,4.25,6.25,9.5625,12.429,16.091000000000001,17.719000000000001,19.5,-1000,-1000,5.3333000000000004,8.5587999999999997,11.932,15,19.312999999999999,22.4,24.428999999999998,25.466999999999999,-1000,-1000,8.8000000000000007,14.625,19.5,21.75,26.85,28.5,30,32.768999999999998,-1000,-1000]
["3x4:3 10%",0.49037999999999998,2.6133999999999999,4.4820000000000002,7.4333,10.943,14.403,16.033999999999999,17.713000000000001,-1000,-1000,3.7856999999999998,7.17,10.472,13.676,17.53,20.824000000000002,22.459,23.991,-1000,-1000,7.0385,11.858000000000001,16.538,19.832999999999998,23.928999999999998,26.687999999999999,28.306999999999999,30.082999999999998,-1000,-1000]
["3x3:3 1%",5,5.8333000000000004,8.3332999999999995,10.5,14.25,17.687999999999999,19.277999999999999,21.75,-1000,-1000,7.4423000000000004,11.1,15.429,17.844999999999999,22.375,25.158999999999999,26.765999999999998,29,-1000,-1000,17.786000000000001,30,35.700000000000003,34.35,39.5,41,42.75,43.5,-1000,-1000]
["3x3:3 10%",1.5832999999999999,3.8957999999999999,6,8.8888999999999996,12.678000000000001,16.085000000000001,17.670000000000002,19.262,-1000,-1000,5.7367999999999997,9.5652000000000008,13.43,16.248000000000001,20.311,23.516999999999999,25.207000000000001,26.861000000000001,-1000,-1000,11.343999999999999,21.474,28.332999999999998,30.213999999999999,34.969000000000001,35.323,36.923000000000002,39.338999999999999,-1000,-1000]
["2x2:2 1%",6.6,8.5908999999999995,11.143000000000001,13.75,17.422999999999998,20.5,22.263000000000002,23.896999999999998,-1000,-1000,18,24.954999999999998,28.5,30,34.070999999999998,33.938000000000002,35.625,38.700000000000003,-1000,-1000,-1000,-1000,-1000,-1000,-1000,-1000,-1000,-1000,-1000,-1000]
["2x2:2 10%",3.9643000000000002,5.9545000000000003,8.9107000000000003,11.302,15.039,18.433,20.36,22.12,-1000,-1000,11.464,17.920999999999999,23.22,25.312999999999999,28.9,29.844000000000001,31.928999999999998,34.384999999999998,-1000,-1000,-1000,-1000,-1000,-1000,-1000,-1000,-1000,-1000,-1000,-1000]
["1x1:1 1%",13.8,15,18.375,21.375,24.75,26.7,29.25,32.570999999999998,-1000,-1000,-1000,-1000,-1000,-1000,-1000,-1000,-1000,-1000,-1000,-1000,-1000,-1000,-1000,-1000,-1000,-1000,-1000,-1000,-1000,-1000]
["1x1 :1 10%",9.6617999999999995,11.738,15.484,16.262,20.859000000000002,23.574999999999999,25.875,28.390999999999998,-1000,-1000,-1000,-1000,-1000,-1000,-1000,-1000,-1000,-1000,-1000,-1000,-1000,-1000,-1000,-1000,-1000,-1000,-1000,-1000,-1000,-1000]
["3x3:3 1% (BF) [VHT]",0,3,5.8,7.38,10.1,13.3,15,16,20.399999999999999,22,5.8,7.5,10.4,13.3,16.5,20.7,22,23.7,27.5,29.5,21,25.5,31,31.3,36,36.75,38.299999999999997,40.1,40.200000000000003,43.1]
["3x3:3 10% (BF) [VHT]",-3,0,3.4,5.7,8.4,11.8,13.2,14.7,18.2,20,4.3,6.8,9.3000000000000007,12.1,15.5,19.100000000000001,20.6,22.3,25.7,27.7,14.6,18.7,25.7,26.6,30.9,31.5,33.5,35.5,36.9,39.4]
["3x3:3 1% [VHT]",3.6,5,7.3,10.1,13.4,17.399999999999999,18.600000000000001,20.6,23.8,25.9,7.3,11.4,15,18.3,22.2,25,27,28.9,32.4,34,21.3,30,36.9,35.799999999999997,41.5,42,43.5,45.3,44.5,46.2]
["3x3:3 10% [VHT]",1.1000000000000001,3.4,5.8,8.6999999999999993,11.8,15.5,71,18.899999999999999,22.2,24,5.8,9.6999999999999993,13.4,16.3,20.3,23.4,25.2,27.1,29.9,32.4,11.7,23.7,30.5,31.8,35.200000000000003,35.9,37.5,39.5,40,42.3]
[]
[]
["Modem","# SS",null,null,"MCS Limit",null,null,"# BF",null,null,"# TX",null,null,"# RX",null,null,"NF"]
[null,"Radio 1","Radio 2","Radio 3","Radio 1","Radio 2","Radio 3","Radio 1","Radio 2","Radio 3","Radio 1","Radio 2","Radio 3","Radio 1","Radio 2","Radio 3","Radio 1","Radio 2","Radio 3"]
["AP3600",3,3,3,8,8,10,4,4,3,4,4,3,4,4,3,6,6,6]
["AP2600",3,3,0,8,8,0,3,3,0,3,3,0,4,4,0,6,6,0]
["AP1600",2,2,0,8,8,0,3,3,0,3,3,0,3,3,0,6,6,0]
["AP3500",2,2,0,8,8,0,0,0,0,2,2,0,3,3,0,6,6,0]
["AP1530e",2,2,0,8,8,0,0,0,0,2,2,0,2,2,0,6,6,0]
["AP1530i",3,2,0,8,8,0,0,0,0,3,2,0,3,3,0,6,6,0]
["AP1550",2,2,0,8,8,0,0,0,0,2,2,0,3,3,0,6,6,0]
["iPhone 4S",1,0,0,8,0,0,0,0,0,1,0,0,1,0,0,10,10,0]
["iPhone 5",1,1,0,8,8,0,0,0,0,1,1,0,1,1,0,10,10,0]
["Galaxy SIII",1,1,0,8,8,0,0,0,0,1,1,0,1,1,0,10,10,0]
["iPad 3",1,1,0,8,8,0,0,0,0,1,1,0,1,1,0,10,10,0]
["MacBook Pro",2,2,0,8,8,0,0,0,0,2,2,0,2,2,0,10,10,0]
["Generic",3,3,3,10,10,10,0,0,0,3,3,3,3,3,3,10,10,10]
[]
[null,null,null,null,null,null,null,null,null,null,null,null,null,null,null,null,{"$f":"S$173-S$159","v":7.1819999999999986},{"$f":"V$173-V$159","v":4.2860000000000014},12.25,11.700000000000003,9.8500000000000014,11,11.5,12,10.200000000000003]
["3x3 BF gains",null,null,null,null,null,null,null,null,null,null,null,null,null,null,null,{"$f":"S$174-S$160","v":6.7469999999999999},{"$f":"V$174-V$160","v":1.0449999999999999},8.0120000000000005,10.111999999999998,10.404999999999998,11.469000000000001,10.257000000000001,10.086000000000002,10.099999999999998]
["3600 BF gain (1%)",{"$f":"B$173-B$159","v":-1.5},-0.72919999999999963,1.5332999999999997,3.2308000000000003,5.5312000000000001,5.8949999999999996,6.0779999999999994,7.0310000000000006,{"$f":"L$173-L$159","v":0.84230000000000071},4.0999999999999996,6.5614000000000008,6.0759999999999987,7.5,6.9089999999999989,6.4479999999999968,{"$f":"S$173-S$161","v":5.3120000000000012},{"$f":"V$173-V$161","v":-0.21399999999999864},7.5,4.9500000000000028,3.6000000000000014,5,5.6000000000000014,5.4369999999999976,3]
["3600 BF gain (10%)",{"$f":"B$174-B$160","v":-1.3921000000000001},1.1002999999999998,2.5,4.4785999999999992,5.7297000000000011,5.8710000000000004,6.027000000000001,6.2469999999999999,{"$f":"L$174-L$160","v":2.5393999999999997},4.1485000000000012,6.0290999999999997,5.9290000000000003,6.8940000000000001,6.4879999999999995,6.4480000000000004,{"$f":"S$174-S$162","v":4.6539999999999999},{"$f":"V$174-V$162","v":-2.2000000000000011},3.5990000000000002,3.3649999999999984,5.0209999999999972,4.7420000000000009,4.4660000000000011,3.6330000000000027,3.7439999999999998]
["2600 BF gain (1%)",{"$f":"B$173-B$161","v":0.625},0.33330000000000037,2.4999999999999991,3.3947000000000003,4.25,4.8129999999999988,4.8139999999999983,5.625,{"$f":"L$173-L$161","v":1.6298000000000004},2.6356999999999999,4.3659999999999997,4.4389999999999983,5.0569999999999986,4.5589999999999975,4.5389999999999979,0,0,0,0,0,0,0,0,0]
["2600 BF gain (10%)",{"$f":"B$174-B$162","v":-0.17280000000000006},1.7448999999999999,2.6808999999999998,3.5726999999999993,4.5064000000000011,4.7480000000000011,4.881000000000002,4.9920000000000009,{"$f":"L$174-L$162","v":1.4345999999999997},2.5795000000000012,3.9460999999999995,4.2480000000000011,4.6590000000000007,4.4349999999999987,4.5340000000000025,0,0,0,0,0,0,0,0,0]
["1600 BF gain (1%)",{"$f":"B$173-B$161","v":0.625},0.33330000000000037,2.4999999999999991,3.3947000000000003,4.25,4.8129999999999988,4.8139999999999983,5.625,0,0,0,0,0,0,0]
["1600 BF gain (10%)",{"$f":"B$174-B$162","v":-0.17280000000000006},1.7448999999999999,2.6808999999999998,3.5726999999999993,4.5064000000000011,4.7480000000000011,4.881000000000002,4.9920000000000009,0,0,0,0,0,0,0]
[null,null,null,null,null,null,null,null,null,null,null,null,null,null,null,null,{"$f":"S$175-S$163","v":13.200000000000003},{"$f":"V$175-V$163","v":0},0,0,0,0,0,0,0]
["2x2 BF gains",null,null,null,null,null,null,null,null,null,null,null,null,null,null,null,{"$f":"S$176-S$164","v":10.966999999999999},{"$f":"V$176-V$164","v":0},0,0,0,0,0,0,0]
["3600 BF gain (1%)",{"$f":"B$175-B$163","v":-1.5999999999999996},9.0899999999999537E-2,0.94300000000000139,4.4499999999999993,6.1729999999999983,7.0600000000000005,7.4500000000000011,7.546999999999997,{"$f":"L$175-L$163","v":8.25},13.227999999999998,13.2,13.5,14.903999999999996,12.188000000000002,11.925000000000001,{"$f":"S$175-S$165","v":8.7000000000000028},{"$f":"V$175-V$165","v":0},0,0,0,0,0,0,0]
["3600 BF gain (10%)",{"$f":"B$176-B$164","v":-0.98249999999999948},0.63630000000000031,3.4821,4.8331999999999997,6.3675999999999995,6.673,7.1809999999999992,7.3290000000000006,{"$f":"L$176-L$164","v":4.3711000000000002},8.9804999999999993,11.491,11.77,12.138999999999999,10.056000000000001,9.9939999999999998,{"$f":"S$176-S$166","v":7.9989999999999988},{"$f":"V$176-V$166","v":0},0,0,0,0,0,0,0]
["2600 BF gain (1%)",{"$f":"B$175-B$165","v":-0.65000000000000036},1.0908999999999995,1.8930000000000007,4.4499999999999993,5.695999999999998,5.5,5.8780000000000001,6.0640000000000001,{"$f":"L$175-L$165","v":6.6},9.9549999999999983,10,8.625,10.970999999999997,9.105000000000004,8.9059999999999988,0,0,0,0,0,0,0,0,0]
["2600 BF gain (10%)",{"$f":"B$176-B$166","v":8.7400000000000144E-2},1.3420000000000005,3.6047000000000002,4.2487999999999992,5.0517000000000003,5.33,5.6440000000000001,5.929000000000002,{"$f":"L$176-L$166","v":2.5548999999999999},6.3059999999999992,8.4099999999999984,9.0760000000000005,9.4479999999999968,7.4050000000000011,7.66,0,0,0,0,0,0,0,0,0]
["1600 BF gain (1%)",{"$f":"B$175-B$165","v":-0.65000000000000036},1.0908999999999995,1.8930000000000007,4.4499999999999993,5.695999999999998,5.5,5.8780000000000001,6.0640000000000001,0,0,0,0,0,0,0]
["1600 BF gain (10%)",{"$f":"B$176-B$166","v":8.7400000000000144E-2},1.3420000000000005,3.6047000000000002,4.2487999999999992,5.0517000000000003,5.33,5.6440000000000001,5.929000000000002,0,0,0,0,0,0,0]
[null,null,null,null,null,null,null,null,null,null,null,null,null,null,null,null,{"$f":"S$177-S$167","v":0},{"$f":"V$177-V$167","v":0},0,0,0,0,0,0,0]
["1x1 BF gains",null,null,null,null,null,null,null,null,null,null,null,null,null,null,null,{"$f":"S$178-S$168","v":0},{"$f":"V$178-V$168","v":0},0,0,0,0,0,0,0]
["3600 BF gain (1%)",{"$f":"B$177-B$167","v":-1.5},-0.40000000000000036,2.875,5.7750000000000004,8.25,8.9499999999999993,10.125,12.641999999999999,{"$f":"L$177-L$167","v":0},0,0,0,0,0,0,{"$f":"S$177-S$169","v":0},{"$f":"V$177-V$169","v":0},0,0,0,0,0,0,0]
["3600 BF gain (10%)",{"$f":"B$178-B$168","v":-0.53819999999999979},1.3059999999999992,4.843,4.793000000000001,8.8950000000000014,8.7929999999999993,9.5360000000000014,10.501999999999999,{"$f":"L$178-L$168","v":0},0,0,0,0,0,0,{"$f":"S$178-S$170","v":0},{"$f":"V$178-V$170","v":0},0,0,0,0,0,0,0]
["2600 BF gain (1%)",{"$f":"B$177-B$169","v":-0.19999999999999929},0.80000000000000071,3.875,6.375,8.85,8.0569999999999986,9,10.445999999999998,{"$f":"L$177-L$169","v":0},0,0,0,0,0,0,0,0,0,0,0,0,0,0,0]
["2600 BF gain (10%)",{"$f":"B$178-B$170","v":-0.12080000000000091},1.6999999999999993,5.2189999999999994,5.6620000000000008,7.6620000000000026,7.286999999999999,7.9660000000000011,8.7609999999999992,{"$f":"L$178-L$170","v":0},0,0,0,0,0,0,0,0,0,0,0,0,0,0,0]
["1600 BF gain (1%)",{"$f":"B$177-B$169","v":-0.19999999999999929},0.80000000000000071,3.875,6.375,8.85,8.0569999999999986,9,10.445999999999998,0,0,0,0,0,0,0]
["1600 BF gain (10%)",{"$f":"B$178-B$170","v":-0.12080000000000091},1.6999999999999993,5.2189999999999994,5.6620000000000008,7.6620000000000026,7.286999999999999,7.9660000000000011,8.7609999999999992,0,0,0,0,0,0,0]
[]
[]
[]
[]
[]
[]
[]
[]
[]
[]
[]
[]
[]
[]
[]
[]
[]
[]
[]
[]
[]
[]
[]
[]
[]
[]
[]
[]
[]
[]
[]
[]
[]
[]
[]
[]
["TPO Back-off (FCC-only)","Spec.","Product","Error","Competition","Loss","Avg. loss","LOS BF Gain","Avg, BF gain","Effective LOS BF Gain","Avg. eff BF loss"]
["3600 UNI-I (3ss)",{"$f":"E262-H262","v":14.750612633917001},14,{"$f":"B262-C262","v":0.75061263391700095},16,{"$f":"E262-C262","v":2},{"$f":"AVERAGE(F262:F263)","v":2.5},{"$f":"10*LOG10(4/3)","v":1.2493873660829993},{"$f":"AVERAGE(H262,H263)","v":1.2493873660829993},{"$f":"H262-F262","v":-0.75061263391700073},{"$f":"-AVERAGE(J262,J263)","v":1.2506126339170007}]
["3600 UNI-II (3ss)",21.750612633917001,20,1.7506126339170009,23,3,{"$f":"AVERAGE(F264:F265)","v":0},{"$f":"10*LOG10(4/3)","v":1.2493873660829993},null,-1.7506126339170007,{"$f":"-AVERAGE(J264,J265)","v":0}]
["2600 UNI-I (3ss)",16,16,0,16,0,{"$f":"AVERAGE(F266:F267)","v":0.5},0,{"$f":"AVERAGE(H264,H265)","v":0},0,{"$f":"-AVERAGE(J266,J267)","v":0.5}]
["2600 UNI-II (3ss)",23,23,0,23,0,{"$f":"AVERAGE(F268:F269)","v":4},0,null,0,{"$f":"-AVERAGE(J268,J269)","v":0.98970004336018791}]
["1600 UNI-I (3ss)",16,16,0,16,0,{"$f":"AVERAGE(F270:F271)","v":3},0,{"$f":"AVERAGE(H266,H267)","v":0},0,{"$f":"-AVERAGE(J270,J271)","v":1.2390874094431874}]
["1600 UNI-II (3ss)",23,22,1,23,1,{"$f":"AVERAGE(F272:F273)","v":0.5},0,null,-1,{"$f":"-AVERAGE(J272,J273)","v":0.5}]
["3600 UNI-I (2ss)",12.989700043360187,11,1.9897000433601875,16,5,{"$f":"AVERAGE(F274:F275)","v":7},{"$f":"10*LOG10(4/2)","v":3.0102999566398121},{"$f":"AVERAGE(H268,H269)","v":3.0102999566398121},-1.9897000433601879,{"$f":"-AVERAGE(J274,J275)","v":0.97940008672037582}]
["3600 UNI-II (2ss)",19.989700043360187,20,-1.0299956639812535E-2,23,3,{"$f":"AVERAGE(F276:F277)","v":5.5},{"$f":"10*LOG10(4/2)","v":3.0102999566398121},null,1.0299956639812091E-2,{"$f":"-AVERAGE(J276,J277)","v":0.72878745280337576}]
["2600 UNI-I (2ss)",14.239087409443188,14,0.23908740944318829,16,2,{"$f":"AVERAGE(F278:F279)","v":3.5},{"$f":"10*LOG10(3/2)","v":1.7609125905568124},{"$f":"AVERAGE(H270,H271)","v":1.7609125905568124},-0.23908740944318763,{"$f":"-AVERAGE(J278,J279)","v":0.48970004336018791}]
["2600 UNI-II (2ss)",21.239087409443187,19,2.2390874094431865,23,4,null,{"$f":"10*LOG10(3/2)","v":1.7609125905568124},null,-2.2390874094431874]
["1600 UNI-I (2ss)",16,16,0,16,0,null,0,{"$f":"AVERAGE(H272,H273)","v":0},0]
["1600 UNI-II (2ss)",23,22,1,23,1,null,0,null,-1]
["3600 UNI-I (1ss)",9.9794000867203749,8,1.9794000867203749,16,8,null,{"$f":"10*LOG10(4/1)","v":6.0205999132796242},{"$f":"AVERAGE(H274,H275)","v":6.0205999132796242},-1.9794000867203758]
["3600 UNI-II (1ss)",16.979400086720375,17,-2.0599913279625071E-2,23,6,null,{"$f":"10*LOG10(4/1)","v":6.0205999132796242},null,2.0599913279624182E-2]
["2600 UNI-I (1ss)",11.228787452803376,11,0.22878745280337576,16,5,null,{"$f":"10*LOG10(3/1)","v":4.7712125471966242},{"$f":"AVERAGE(H276,H277)","v":4.7712125471966242},-0.22878745280337576]
["2600 UNI-II (1ss)",18.228787452803374,17,1.228787452803374,23,6,null,{"$f":"10*LOG10(3/1)","v":4.7712125471966242},null,-1.2287874528033758]
["1600 UNI-I (1ss)",12.989700043360187,13,-1.0299956639812535E-2,16,3,null,{"$f":"10*LOG10(2/1)","v":3.0102999566398121},{"$f":"AVERAGE(H278,H279)","v":3.0102999566398121},1.0299956639812091E-2]
["1600 UNI-II (1ss)",19.989700043360187,19,0.98970004336018746,23,4,null,{"$f":"10*LOG10(2/1)","v":3.0102999566398121},null,-0.98970004336018791]
[null,null,null,null,null,null,null,null,null,null,null,null,null,null,null,null,{"$f":"Q$202-$G$262","v":4.2469999999999999},-1.4550000000000001,5.5120000000000005,7.6119999999999983,7.9049999999999976,8.9690000000000012,7.7570000000000014,7.5860000000000021,7.5999999999999979]
["Effective BF gain by MCS",null,null,null,null,null,null,null,null,null,null,null,null,null,null,null,{"$f":"Q$204-$G$263","v":4.6539999999999999},-2.2000000000000011,3.5990000000000002,3.3649999999999984,5.0209999999999972,4.7420000000000009,4.4660000000000011,3.6330000000000027,3.7439999999999998]
["3600 (3ss)",{"$f":"B$204-$G$262","v":-3.8921000000000001},-1.3997000000000002,0,1.9785999999999992,3.2297000000000011,3.3710000000000004,3.527000000000001,3.7469999999999999,3.9399999999999658E-2,1.6485000000000012,3.5290999999999997,3.4290000000000003,4.3940000000000001,3.9879999999999995,3.9480000000000004,{"$f":"Q$206-$G$264","v":-0.5},0,0,0,0,0,0,0,0]
["2600 (3ss)",{"$f":"B$206-$G$263","v":-0.17280000000000006},1.7448999999999999,2.6808999999999998,3.5726999999999993,4.5064000000000011,4.7480000000000011,4.881000000000002,4.9920000000000009,1.4345999999999997,2.5795000000000012,3.9460999999999995,4.2480000000000011,4.6590000000000007,4.4349999999999987,4.5340000000000025,{"$f":"Q$210-$G$265","v":6.9669999999999987},0,0,0,0,0,0,0,0]
["1600 (3ss)",{"$f":"B$208-$G$264","v":-0.67280000000000006},1.2448999999999999,2.1808999999999998,3.0726999999999993,4.0064000000000011,4.2480000000000011,4.381000000000002,4.4920000000000009,-0.5,-0.5,-0.5,-0.5,-0.5,-0.5,-0.5,{"$f":"Q$212-$G$266","v":4.9989999999999988},0,0,0,0,0,0,0,0]
["3600 (2ss)",{"$f":"B$212-$G$265","v":-4.9824999999999999},-3.3636999999999997,-0.51790000000000003,0.83319999999999972,2.3675999999999995,2.673,3.1809999999999992,3.3290000000000006,0.37110000000000021,4.9804999999999993,7.4909999999999997,7.77,8.1389999999999993,6.0560000000000009,5.9939999999999998,0,0,0,0,0,0,0,0,0]
["2600 (2ss)",{"$f":"B$214-$G$266","v":-2.9125999999999999},-1.6579999999999995,0.60470000000000024,1.2487999999999992,2.0517000000000003,2.33,2.6440000000000001,2.929000000000002,-0.44510000000000005,3.3059999999999992,5.4099999999999984,6.0760000000000005,6.4479999999999968,4.4050000000000011,4.66,0,0,0,0,0,0,0,0,0]
["1600 (2ss)",{"$f":"B$216-$G$267","v":-0.41259999999999986},0.84200000000000053,3.1047000000000002,3.7487999999999992,4.5517000000000003,4.83,5.1440000000000001,5.429000000000002,0,0,0,0,0,0,0,0,0,0,0,0,0,0,0,0]
["3600 (1ss)",{"$f":"B$220-$G$268","v":-7.5381999999999998},-5.6940000000000008,-2.157,-2.206999999999999,1.8950000000000014,1.7929999999999993,2.5360000000000014,3.5019999999999989,0,0,0,0,0,0,0,0,0,0,0,0,0,0,0,0]
["2600 (1ss)",{"$f":"B$222-$G$269","v":-5.6208000000000009},-3.8000000000000007,-0.28100000000000058,0.16200000000000081,2.1620000000000026,1.786999999999999,2.4660000000000011,3.2609999999999992,0,0,0,0,0,0,0]
["1600 (1ss)",{"$f":"B$224-$G$270","v":-3.6208000000000009},-1.8000000000000007,1.7189999999999994,2.1620000000000008,4.1620000000000026,3.786999999999999,4.4660000000000011,5.2609999999999992,0,0,0,0,0,0,0]
[]
[]
[]
[]
[]
[]
[]
[]
[]
[]
[]
[]
[]
[]
[]
[]
[]
[]
[]
[]
[]
[]
[]
[]
[]
[]
[]
[]
[]
[]
[]
[]
[]
[]
[]
[]
[]
[]
[]
[]
[]
[null,null,null,null,null,null,null,null,null,null,null,null,null,null,null,null,null,null,null,"AC_VO",null,null,null,null,null,null,null,null,"System-wide"]
["QoS-based Estimation",null,null,null,null,null,null,null,null,null,null,null,null,null,null,null,null,null,null,{"$f":"IF($T$334>0,2/($D$22+2),0)","v":0}]
[null,"AC_BE",null,null,null,null,null,null,null,null,"AC_VI",null,null,null,null,null,null,null,null,{"$f":"$D$12","v":0}]
["p",{"$f":"IF($B$336>0,2/($B$22+2),0)","v":1.9512195121951219E-3},null,null,null,null,null,null,null,null,{"$f":"IF($K$336>0,2/($C$22+2),0)","v":0},null,null,null,null,null,null,null,null,{"$f":"$D$23","v":2}]
["M",{"$f":"$B$12","v":10},null,null,null,null,null,null,null,null,{"$f":"$C$12","v":0},null,null,null,null,null,null,null,null,null,null,null,null,null,null,null,null,null,"E[R]"]
["AIFSN",{"$f":"$B$23","v":7},null,null,null,null,null,null,null,null,{"$f":"$C$23","v":3},null,null,null,null,null,"prod c > d","P(Success)","P(Transmit)","P(Rd>=ka)","(1-p)^(max(0,k-AIFSN)","P(0txd)","P(0txd-1)","P(1txc)","prod c < d","prod c > d","P(Success)","P(Transmit)","prod(P(Rd>=ka)"]
[null,null,null,null,null,null,null,null,null,null,null,null,null,null,null,null,{"$f":"$E340","v":1},{"$f":"O340*P340*Q338","v":0},{"$f":"$K$335*$AC338","v":0},{"$f":"(1-$T$333)^($T$334*MAX(0,$A340-$T$335))","v":1},{"$f":"(1-$T$333)^(MAX(0,$A340-$T$335))","v":1},{"$f":"((1-$T$333)^(MAX(0,$A340+1-$T$335)))^$T$334","v":1},{"$f":"((1-$T$333)^(MAX(0,$A340+1-$T$335)))^($T$334-1)*U338","v":1},{"$f":"$T$334*$T$333*((1-$T$333)^($A340-$T$335)*(((1-$T$333)^($A340+1-$T$335))^($T$334-1)))","v":0},{"$f":"$M340*$D340","v":1},1,{"$f":"Z338*Y338*X338","v":0},{"$f":"$T$333*$AC338","v":0},{"$f":"PRODUCT($B340,$K340,$T338)","v":1}]
["k (slot)","P(Rd>=ka)","(1-p)^max(0,k-AIFSN)","P(0txd)","P(0txd-1)","P(1txc)","prod c < d","prod c > d","P(Success)","P(Transmit)","P(Rd>=ka)","(1-p)^max(0,k-AIFSN)","P(0txd)","P(0txd-1)","P(1txc)","prod c < d",1,0,0,1,1,1,{"$f":"((1-$T$333)^(MAX(0,$A341+1-$T$335)))^($T$334-1)","v":1},0,1,1,0,0,1]
[0,{"$f":"(1-$B$335)^($B$336*MAX(0,$A340-$B$337))","v":1},{"$f":"(1-$B$335)^(MAX(0,$A340-$B$337))","v":1},{"$f":"((1-$B$335)^(MAX(0,$A340+1-$B$337)))^$B$336","v":1},{"$f":"((1-$B$335)^(MAX(0,$A340+1-$B$337)))^($B$336-1)*C340","v":1},{"$f":"$B$336*$B$335*((1-$B$335)^($A340-$B$337)*(((1-$B$335)^($A340+1-$B$337))^($B$336-1)))","v":2.1981041324131794E-2},1,{"$f":"$N340*$W338","v":1},{"$f":"F340*G340*H340","v":2.1981041324131794E-2},{"$f":"$B$335*$AC338","v":1.9512195121951219E-3},{"$f":"(1-$K$335)^($K$336*MAX(0,$A340-$K$337))","v":1},{"$f":"(1-$K$335)^(MAX(0,$A340-$K$337))","v":1},{"$f":"((1-$K$335)^(MAX(0,$A340+1-$K$337)))^$K$336","v":1},{"$f":"((1-$K$335)^(MAX(0,$A340+1-$K$337)))^($K$336-1)*L340","v":1},{"$f":"$K$336*$K$335*((1-$K$335)^($A340-$K$337)*(((1-$K$335)^($A340+1-$K$337))^($K$336-1)))","v":0},{"$f":"$V338","v":1},1,0,0,1,1,1,1,0,1,1,0,0,1]
[1,1,1,1,1,2.1555889365350273E-2,1,1,2.1555889365350273E-2,1.9512195121951219E-3,1,1,1,1,0,{"$f":"$V339","v":1},1,0,0,1,1,1,1,0,1,1,0,0,1]
[2,1,1,1,1,2.1138960592421988E-2,1,1,2.1138960592421988E-2,1.9512195121951219E-3,1,1,1,1,0,1,1,0,0,1,1,1,1,0,1,1,0,0,1]
[3,1,1,1,1,2.0730095954484804E-2,1,1,2.0730095954484804E-2,1.9512195121951219E-3,1,1,1,1,0,1,1,0,0,1,1,1,1,0,1,1,0,0,1]
[4,1,1,1,1,2.0329139476999679E-2,1,1,2.0329139476999679E-2,1.9512195121951219E-3,1,1,1,1,0,1,1,0,0,1,1,1,1,0,1,1,0,0,1]
[5,1,1,1,1,1.9935938202249318E-2,1,1,1.9935938202249318E-2,1.9512195121951219E-3,1,1,1,1,0,1,0.98257546346732882,0,0,1,1,1,1,0,0.98065824305080718,1,0,0,1]
[6,1,1,1,1,1.9550342130987292E-2,1,1,1.9550342130987292E-2,1.9512195121951219E-3,1,1,1,1,0,1,0.96357072766870322,0,0,1,1,1,1,0,0.96169058966349596,1,0,0,0.98065824305080718]
[7,1,1,0.98065824305080718,0.98257546346732882,1.9172204165216172E-2,1,1,1.9172204165216172E-2,1.9512195121951219E-3,1,1,1,1,0,1,0.94493357685077861,0,0,1,1,1,1,0,0.94308980401789899,1,0,0,0.96169058966349596]
[8,0.98065824305080718,0.99804878048780488,0.96169058966349596,0.96357072766870322,1.8801380052072259E-2,1,1,1.8801380052072259E-2,1.9134794986357213E-3,1,1,1,1,0,1,0.92665690127419909,0,0,1,1,1,1,0,0.92484879024732247,1,0,0,0.94308980401789866]
[9,0.96169058966349596,0.99610136823319451,0.94308980401789899,0.94493357685077861,1.8437728328795679E-2,1,1,1.8437728328795679E-2,1.8764694432458458E-3,1,1,1,1,0,1,0.90873372871446179,0,0,1,1,1,1,0,0.90696058973160443,1,0,0,0.92484879024732247]
[10,0.94308980401789866,0.99415775580737364,0.92484879024732247,0.92665690127419909,1.8081110268764859E-2,1,1,1.8081110268764859E-2,1.8401752273519974E-3,1,1,1,1,0,1,0.89115722180213297,0,0,1,1,1,1,0,0.88941837844251903,1,0,0,0.90696058973160376]
[11,0.92484879024732247,0.99221793579604212,0.90696058973160443,0.90873372871446179,1.7731389828574865E-2,1,1,1.7731389828574865E-2,1.8045830053606293E-3,1,1,1,1,0,1,0.87392067541451812,0,0,1,1,1,1,0,0.87221546434053865,1,0,0,0.88941837844251848]
[12,0.90696058973160376,0.99028190079936695,0.88941837844251903,0.89115722180213297,1.7388433596139181E-2,1,1,1.7388433596139181E-2,1.7696791994763E-3,1,1,1,1,0,1,0.85701751411777549,0,0,1,1,1,1,0,0.85534528482193595,1,0,0,0.87221546434053798]
[13,0.88941837844251848,0.98834964343195353,0.87221546434053865,0.87392067541451812,1.7052110739795477E-2,1,1,1.7052110739795477E-2,1.7354504945219873E-3,1,1,1,1,0,1,0.84044128965850817,0,0,1,1,1,1,0,0.83880140421527205,1,0,0,0.85534528482193595]
[14,0.87221546434053798,0.98642115632281802,0.85534528482193595,0.85701751411777549,1.672229295839562E-2,1,1,1.672229295839562E-2,1.7018838328595864E-3,1,1,1,1,0,1,0.82418567850386715,0,0,1,1,1,1,0,0.82257751132629864,1,0,0,0.83880140421527194]
[15,0.85534528482193595,0.98449643211535875,0.83880140421527205,0.84044128965850817,1.6398854432361134E-2,1,1,1.6398854432361134E-2,1.6689664094086554E-3,1,1,1,1,0,1,0.80824447942923983,0,0,1,1,1,1,0,0.80666741703035338,1,0,0,0.82257751132629842]
[16,0.83880140421527194,0.98257546346732882,0.82257751132629864,0.82418567850386715,1.6081671775685213E-2,1,1,1.6081671775685213E-2,1.6366856667615062E-3,1,1,1,1,0,1,0.79261161115259271,0,0,1,1,1,1,0,0.79106505191131926,1,0,0,0.80666741703035327]
[17,0.82257751132629842,0.98065824305080718,0.80666741703035338,0.80824447942923983,1.5770623988863215E-2,1,1,1.5770623988863215E-2,1.6050292903927773E-3,1,1,1,1,0,1,0.7772811100145709,0,0,1,1,1,1,0,0.77576446394624965,1,0,0,0.79106505191131893]
[18,0.80666741703035327,0.97874476355217144,0.79106505191131926,0.79261161115259271,1.5465592412733516E-2,1,1,1.5465592412733516E-2,1.573985203961665E-3,1,1,1,1,0,1,0.76224712770347025,0,0,1,1,1,1,0,0.76075981623478051,1,0,0,0.77576446394624954]
[19,0.79106505191131893,0.97683501767206959,0.77576446394624965,0.7772811100145709,1.516646068321114E-2,1,1,1.516646068321114E-2,1.5435415647050126E-3,1,1,1,1,0,1,0.7475039290242097,0,0,1,1,1,1,0,0.74604538477245508,1,0,0,0.76075981623478028]
[20,0.77576446394624954,0.97492899812539235,0.76075981623478051,0.76224712770347025,1.487311468689698E-2,1,1,1.487311468689698E-2,1.5136867589195112E-3,1,1,1,1,0,1,0.73304588971045614,0,0,1,1,1,1,0,0.73161555626711861,1,0,0,0.74604538477245452]
[21,0.76075981623478028,0.97302669764124528,0.74604538477245508,0.7475039290242097,1.4585442517545556E-2,1,1,1.4585442517545556E-2,1.4844093975312786E-3,1,1,1,1,0,1,0.71886749427907215,0,0,1,1,1,1,0,0.71746482599755201,1,0,0,0.73161555626711861]
[22,0.74604538477245452,0.9711281089629209,0.73161555626711861,0.73304588971045614,1.4303334433374754E-2,1,1,1.4303334433374754E-2,1.4556983117511308E-3,1,1,1,1,0,1,0.70496333392605093,0,0,1,1,1,1,0,0.70358779571351227,1,0,0,0.71746482599755146]
[23,0.73161555626711861,0.96923322484787122,0.71746482599755201,0.71886749427907215,1.4026682815201408E-2,1,1,1.4026682815201408E-2,1.4275425488138899E-3,1,1,1,1,0,1,0.69132810446316084,0,0,1,1,1,1,0,0.68997917157640343,1,0,0,0.70358779571351193]
[24,0.71746482599755146,0.96734203806768027,0.70358779571351227,0.70496333392605093,1.3755382125386359E-2,1,1,1.3755382125386359E-2,1.3999313678001004E-3,1,1,1,1,0,1,0.6779566042944879,0,0,1,1,1,1,0,0.67663376213976689,1,0,0,0.68997917157640287]
[25,0.70358779571351193,0.96545454140803599,0.68997917157640343,0.69132810446316084,1.348932886757387E-2,1,1,1.348932886757387E-2,1.37285423553856E-3,1,1,1,1,0,1,0.66484373243212413,0,0,1,1,1,1,0,0.66354647636884201,1,0,0,0.67663376213976645]
[26,0.68997917157640287,0.96357072766870322,0.67663376213976689,0.6779566042944879,1.322842154720952E-2,1,1,1.322842154720952E-2,1.3463008225881032E-3,1,1,1,1,0,1,0.65198448655022745,0,0,1,1,1,1,0,0.65071232169842208,1,0,0,0.66354647636884123]
[27,0.67663376213976645,0.96169058966349596,0.66354647636884201,0.66484373243212413,1.2972560632821935E-2,1,1,1.2972560632821935E-2,1.3202609992971053E-3,1,1,1,1,0,1,0.63937396107672873,0,0,1,1,1,1,0,0.63812640212828642,1,0,0,0.65071232169842175]
[28,0.66354647636884123,0.95981412022025014,0.65071232169842208,0.65198448655022745,1.2721648518053219E-2,1,1,1.2721648518053219E-2,1.2947248319392023E-3,1,1,1,1,0,1,0.62700734532194002,0,0,1,1,1,1,0,0.62578391635545827,1,0,0,0.63812640212828586]
[29,0.65071232169842175,0.95794131218079592,0.63812640212828642,0.63937396107672873,1.2475589484423975E-2,1,1,1.2475589484423975E-2,1.2696825789237497E-3,1,1,1,1,0,1,0.61487992164336436,0,0,1,1,1,1,0,0.61368015594259684,1,0,0,0.6257839163554576]
[30,0.63812640212828586,0.95607215840093096,0.62578391635545827,0.62700734532194002,1.2234289664818342E-2,1,1,1.2234289664818342E-2,1.2451246870795823E-3,1,1,1,1,0,1,0.60298706364599952,0,0,1,1,1,1,0,0.60181050352181209,1,0,0,0.61368015594259639]
[31,0.6257839163554576,0.95420665175039254,0.61368015594259684,0.61487992164336436,1.1997657007675402E-2,1,1,1.1997657007675402E-2,1.2210417880106489E-3,1,1,1,1,0,1,0.59132423441745086,0,0,1,1,1,1,0,0.59017043103322164,1,0,0,0.60181050352181176]
[32,0.61368015594259639,0.95234478511283083,0.60181050352181209,0.60298706364599952,1.1765601241873161E-2,1,1,1.1765601241873161E-2,1.1974246945221393E-3,1,1,1,1,0,1,0.57988698479718137,0,0,1,1,1,1,0,0.57875549799757697,1,0,0,0.59017043103322153]
[33,0.60181050352181176,0.95048655138578131,0.59017043103322164,0.59132423441745086,1.1538033842291724E-2,1,1,1.1538033842291724E-2,1.1742643971157302E-3,1,1,1,1,0,1,0.56867095167923398,0,0,1,1,1,1,0,0.56756134982229889,1,0,0,0.57875549799757664]
[34,0.59017043103322153,0.94863194348063828,0.57875549799757697,0.57988698479718137,1.1314867996042564E-2,1,1,1.1314867996042564E-2,1.1515520605526273E-3,1,1,1,1,0,1,0.55767185634778793,0,0,1,1,1,1,0,0.55658371614028002,1,0,0,0.56756134982229833]
[35,0.57875549799757664,0.94678095432262732,0.56756134982229889,0.56867095167923398,1.1096018569350908E-2,1,1,1.1096018569350908E-2,1.1292790204830763E-3,1,1,1,1,0,1,0.54688550284490445,0,0,1,1,1,1,0,0.54581840918081692,1,0,0,0.55658371614027968]
[36,0.56756134982229833,0.94493357685077828,0.55658371614028002,0.55767185634778793,1.0881402075078789E-2,1,1,1.0881402075078789E-2,1.1074367801410699E-3,1,1,1,1,0,1,0.53630777636984028,0,0,1,1,1,1,0,0.53526132217204536,1,0,0,0.54581840918081581]
[37,0.55658371614027968,0.94308980401789866,0.54581840918081692,0.54688550284490445,1.0670936640876184E-2,1,1,1.0670936640876184E-2,1.0860170071029848E-3,1,1,1,1,0,1,0.52593464170933313,0,0,1,1,1,1,0,0.52490842777429059,1,0,0,0.53526132217204536]
[38,0.54581840918081581,0.94124962879054674,0.53526132217204536,0.53630777636984028,1.0464541977948104E-2,1,1,1.0464541977948104E-2,1.0650115301089088E-3,1,1,1,1,0,1,0.51576214169823009,0,0,1,1,1,1,0,0.51475577654369686,1,0,0,0.52490842777429003]
[39,0.53526132217204536,0.93941304414900406,0.52490842777429059,0.52593464170933313,1.0262139350426013E-2,1,1,1.0262139350426013E-2,1.0444123359454544E-3,1,1,1,1,0,1,0.50578639570990802,0,0,1,1,1,1,0,0.50479949542559599,1,0,0,0.51475577654369675]
[40,0.52490842777429003,0.93758004308724996,0.51475577654369686,0.51576214169823009,1.0063651545331318E-2,1,1,1.0063651545331318E-2,1.0242115663888587E-3,1,1,1,1,0,1,0.49600359817587886,0,0,1,1,1,1,0,0.49503578627699907,1,0,0,0.50479949542559555]
[41,0.51475577654369675,0.93575061861293329,0.50479949542559599,0.50578639570990802,9.869002843120157E-3,1,1,9.869002843120157E-3,1.0044015152072131E-3,1,1,1,1,0,1,0.48641001713403564,0,0,1,1,1,1,0,0.48546092441767652,1,0,0,0.49503578627699851]
[42,0.50479949542559555,0.93392476374734712,0.49503578627699907,0.49600359817587886,9.678118988797637E-3,1,1,9.678118988797637E-3,9.8497462522067428E-4,1,1,1,1,0,1,0.47700199280497646,0,0,1,1,1,1,0,0.47607125720925941,1,0,0,0.48546092441767619]
[43,0.49503578627699851,0.93210247152540104,0.48546092441767652,0.48641001713403564,9.4909271635909391E-3,1,1,9.4909271635909391E-3,9.6592348541853364E-4,1,1,1,1,0,1,0.46777593619586194,0,0,1,1,1,1,0,0.46686320266182124,1,0,0,0.47607125720925902]
[44,0.48546092441767619,0.93028373499559536,0.47607125720925941,0.47700199280497646,9.3073559571702717E-3,1,1,9.3073559571702717E-3,9.4724082813205112E-4,1,1,1,1,0,1,0.45872832773128003,0,0,1,1,1,1,0,0.45783324806741399,1,0,0,0.46686320266182085]
[45,0.47607125720925902,0.92846854721999417,0.46686320266182124,0.46777593619586194,9.1273353404070622E-3,1,1,9.1273353404070622E-3,9.2891952626196885E-4,1,1,1,1,0,1,0.44985571591059226,0,0,1,1,1,1,0,0.44897794866003499,1,0,0,0.4578332480674141]
[46,0.46686320266182085,0.92665690127419909,0.45783324806741399,0.45872832773128003,8.9507966386591226E-3,1,1,8.9507966386591226E-3,9.1095259055965047E-4,1,1,1,1,0,1,0.44115471599124423,0,0,1,1,1,1,0,0.4402939263015051,1,0,0,0.44897794866003465]
[47,0.4578332480674141,0.92484879024732247,0.44897794866003499,0.44985571591059226,8.777672505572532E-3,1,1,8.777672505572532E-3,8.9333316696080798E-4,1,1,1,1,0,1,0.43262200869755185,0,0,1,1,1,1,0,0.43177786819277614,1,0,0,0.4402939263015051]
[48,0.44897794866003465,0.9230442072419619,0.4402939263015051,0.44115471599124423,8.6078968973901313E-3,1,1,8.6078968973901313E-3,8.7605453397079935E-4,1,1,1,1,0,1,0.42425433895445158,0,0,1,1,1,1,0,0.42342652561015015,1,0,0,0.43177786819277553]
[49,0.4402939263015051,0.92124314537417262,0.43177786819277614,0.43262200869755185,8.4414050477571098E-3,1,1,8.4414050477571098E-3,8.5911010010049772E-4,1,1,1,1,0,1]
[50,0.43177786819277553,0.91944559777344259,0.42342652561015015,0.42425433895445158,8.27813344301369E-3,1,1,8.27813344301369E-3,8.424934013517571E-4,1,1,1,1,0,1,null,{"$f":"SUM(INDEX(R339:R388,$K$337):R388)","v":0},{"$f":"SUM(INDEX(S339:S388,$K$337):S388)","v":0},null,null,null,null,null,null,null,{"$f":"SUM(INDEX(AA339:AA388,$T$335):AA388)","v":0},{"$f":"SUM(INDEX(AB339:AB388,$T$335):AB388)","v":0},{"$f":"SUM(AC339:AC388)","v":35.809777669339915}]
[]
[null,null,null,null,null,null,null,null,{"$f":"SUM(INDEX(I341:I390,$B$337):I390)","v":0.57151914359628719},{"$f":"SUM(INDEX(J341:J390,$B$337):J390)","v":5.8165419842614467E-2}]
[]
[]
["Data-only estimation"]
[null,"AC_BE"]
["p",{"$f":"IF($B$398>0,2/($B$22+2),0)","v":1.9512195121951219E-3}]
["M",{"$f":"$B$12","v":10}]
["AIFSN",{"$f":"$B$23","v":7}]
[]
["k (slot)","P(Rd>=ka)","(1-p)^max(0,k-AIFSN)","P(0txd)","P(0txd-1)","P(1txc)","prod c < d","prod c > d","P(Success)","P(Transmit)"]
[0,{"$f":"(1-$B$397)^($B$398*MAX(0,$A402-$B$399))","v":1},{"$f":"(1-$B$397)^(MAX(0,$A402-$B$399))","v":1},{"$f":"((1-$B$397)^(MAX(0,$A402+1-$B$399)))^$B$398","v":1},{"$f":"((1-$B$397)^(MAX(0,$A402+1-$B$399)))^($B$398-1)*C402","v":1},{"$f":"$B$398*$B$397*((1-$B$397)^($A402-$B$399)*(((1-$B$397)^($A402+1-$B$399))^($B$398-1)))","v":2.1981041324131794E-2},1,1,{"$f":"F402*G402*H402","v":2.1981041324131794E-2},{"$f":"$B$397*$B402","v":1.9512195121951219E-3}]
[1,1,1,1,1,2.1555889365350273E-2,1,1,2.1555889365350273E-2,{"$f":"$B$397*$B403","v":1.9512195121951219E-3}]
[2,1,1,1,1,2.1138960592421988E-2,1,1,2.1138960592421988E-2,1.9512195121951219E-3]
[3,1,1,1,1,2.0730095954484804E-2,1,1,2.0730095954484804E-2,1.9512195121951219E-3]
[4,1,1,1,1,2.0329139476999679E-2,1,1,2.0329139476999679E-2,1.9512195121951219E-3]
[5,1,1,1,1,1.9935938202249318E-2,1,1,1.9935938202249318E-2,1.9512195121951219E-3]
[6,1,1,1,1,1.9550342130987292E-2,1,1,1.9550342130987292E-2,1.9512195121951219E-3]
[7,1,1,0.98065824305080718,0.98257546346732882,1.9172204165216172E-2,1,1,1.9172204165216172E-2,1.9512195121951219E-3]
[8,0.98065824305080718,0.99804878048780488,0.96169058966349596,0.96357072766870322,1.8801380052072259E-2,1,1,1.8801380052072259E-2,1.9134794986357213E-3]
[9,0.96169058966349596,0.99610136823319451,0.94308980401789899,0.94493357685077861,1.8437728328795679E-2,1,1,1.8437728328795679E-2,1.8764694432458458E-3]
[10,0.94308980401789866,0.99415775580737364,0.92484879024732247,0.92665690127419909,1.8081110268764859E-2,1,1,1.8081110268764859E-2,1.8401752273519974E-3]
[11,0.92484879024732247,0.99221793579604212,0.90696058973160443,0.90873372871446179,1.7731389828574865E-2,1,1,1.7731389828574865E-2,1.8045830053606293E-3]
[12,0.90696058973160376,0.99028190079936695,0.88941837844251903,0.89115722180213297,1.7388433596139181E-2,1,1,1.7388433596139181E-2,1.7696791994763E-3]
[13,0.88941837844251848,0.98834964343195353,0.87221546434053865,0.87392067541451812,1.7052110739795477E-2,1,1,1.7052110739795477E-2,1.7354504945219873E-3]
[14,0.87221546434053798,0.98642115632281802,0.85534528482193595,0.85701751411777549,1.672229295839562E-2,1,1,1.672229295839562E-2,1.7018838328595864E-3]
[15,0.85534528482193595,0.98449643211535875,0.83880140421527205,0.84044128965850817,1.6398854432361134E-2,1,1,1.6398854432361134E-2,1.6689664094086554E-3]
[16,0.83880140421527194,0.98257546346732882,0.82257751132629864,0.82418567850386715,1.6081671775685213E-2,1,1,1.6081671775685213E-2,1.6366856667615062E-3]
[17,0.82257751132629842,0.98065824305080718,0.80666741703035338,0.80824447942923983,1.5770623988863215E-2,1,1,1.5770623988863215E-2,1.6050292903927773E-3]
[18,0.80666741703035327,0.97874476355217144,0.79106505191131926,0.79261161115259271,1.5465592412733516E-2,1,1,1.5465592412733516E-2,1.573985203961665E-3]
[19,0.79106505191131893,0.97683501767206959,0.77576446394624965,0.7772811100145709,1.516646068321114E-2,1,1,1.516646068321114E-2,1.5435415647050126E-3]
[20,0.77576446394624954,0.97492899812539235,0.76075981623478051,0.76224712770347025,1.487311468689698E-2,1,1,1.487311468689698E-2,1.5136867589195112E-3]
[21,0.76075981623478028,0.97302669764124528,0.74604538477245508,0.7475039290242097,1.4585442517545556E-2,1,1,1.4585442517545556E-2,1.4844093975312786E-3]
[22,0.74604538477245452,0.9711281089629209,0.73161555626711861,0.73304588971045614,1.4303334433374754E-2,1,1,1.4303334433374754E-2,1.4556983117511308E-3]
[23,0.73161555626711861,0.96923322484787122,0.71746482599755201,0.71886749427907215,1.4026682815201408E-2,1,1,1.4026682815201408E-2,1.4275425488138899E-3]
[24,0.71746482599755146,0.96734203806768027,0.70358779571351227,0.70496333392605093,1.3755382125386359E-2,1,1,1.3755382125386359E-2,1.3999313678001004E-3]
[25,0.70358779571351193,0.96545454140803599,0.68997917157640343,0.69132810446316084,1.348932886757387E-2,1,1,1.348932886757387E-2,1.37285423553856E-3]
[26,0.68997917157640287,0.96357072766870322,0.67663376213976689,0.6779566042944879,1.322842154720952E-2,1,1,1.322842154720952E-2,1.3463008225881032E-3]
[27,0.67663376213976645,0.96169058966349596,0.66354647636884201,0.66484373243212413,1.2972560632821935E-2,1,1,1.2972560632821935E-2,1.3202609992971053E-3]
[28,0.66354647636884123,0.95981412022025014,0.65071232169842208,0.65198448655022745,1.2721648518053219E-2,1,1,1.2721648518053219E-2,1.2947248319392023E-3]
[29,0.65071232169842175,0.95794131218079592,0.63812640212828642,0.63937396107672873,1.2475589484423975E-2,1,1,1.2475589484423975E-2,1.2696825789237497E-3]
[30,0.63812640212828586,0.95607215840093096,0.62578391635545827,0.62700734532194002,1.2234289664818342E-2,1,1,1.2234289664818342E-2,1.2451246870795823E-3]
[31,0.6257839163554576,0.95420665175039254,0.61368015594259684,0.61487992164336436,1.1997657007675402E-2,1,1,1.1997657007675402E-2,1.2210417880106489E-3]
[32,0.61368015594259639,0.95234478511283083,0.60181050352181209,0.60298706364599952,1.1765601241873161E-2,1,1,1.1765601241873161E-2,1.1974246945221393E-3]
[33,0.60181050352181176,0.95048655138578131,0.59017043103322164,0.59132423441745086,1.1538033842291724E-2,1,1,1.1538033842291724E-2,1.1742643971157302E-3]
[34,0.59017043103322153,0.94863194348063828,0.57875549799757697,0.57988698479718137,1.1314867996042564E-2,1,1,1.1314867996042564E-2,1.1515520605526273E-3]
[35,0.57875549799757664,0.94678095432262732,0.56756134982229889,0.56867095167923398,1.1096018569350908E-2,1,1,1.1096018569350908E-2,1.1292790204830763E-3]
[36,0.56756134982229833,0.94493357685077828,0.55658371614028002,0.55767185634778793,1.0881402075078789E-2,1,1,1.0881402075078789E-2,1.1074367801410699E-3]
[37,0.55658371614027968,0.94308980401789866,0.54581840918081692,0.54688550284490445,1.0670936640876184E-2,1,1,1.0670936640876184E-2,1.0860170071029848E-3]
[38,0.54581840918081581,0.94124962879054674,0.53526132217204536,0.53630777636984028,1.0464541977948104E-2,1,1,1.0464541977948104E-2,1.0650115301089088E-3]
[39,0.53526132217204536,0.93941304414900406,0.52490842777429059,0.52593464170933313,1.0262139350426013E-2,1,1,1.0262139350426013E-2,1.0444123359454544E-3]
[40,0.52490842777429003,0.93758004308724996,0.51475577654369686,0.51576214169823009,1.0063651545331318E-2,1,1,1.0063651545331318E-2,1.0242115663888587E-3]
[41,0.51475577654369675,0.93575061861293329,0.50479949542559599,0.50578639570990802,9.869002843120157E-3,1,1,9.869002843120157E-3,1.0044015152072131E-3]
[42,0.50479949542559555,0.93392476374734712,0.49503578627699907,0.49600359817587886,9.678118988797637E-3,1,1,9.678118988797637E-3,9.8497462522067428E-4]
[43,0.49503578627699851,0.93210247152540104,0.48546092441767652,0.48641001713403564,9.4909271635909391E-3,1,1,9.4909271635909391E-3,9.6592348541853364E-4]
[44,0.48546092441767619,0.93028373499559536,0.47607125720925941,0.47700199280497646,9.3073559571702717E-3,1,1,9.3073559571702717E-3,9.4724082813205112E-4]
[45,0.47607125720925902,0.92846854721999417,0.46686320266182124,0.46777593619586194,9.1273353404070622E-3,1,1,9.1273353404070622E-3,9.2891952626196885E-4]
[46,0.46686320266182085,0.92665690127419909,0.45783324806741399,0.45872832773128003,8.9507966386591226E-3,1,1,8.9507966386591226E-3,9.1095259055965047E-4]
[47,0.4578332480674141,0.92484879024732247,0.44897794866003499,0.44985571591059226,8.777672505572532E-3,1,1,8.777672505572532E-3,8.9333316696080798E-4]
[48,0.44897794866003465,0.9230442072419619,0.4402939263015051,0.44115471599124423,8.6078968973901313E-3,1,1,8.6078968973901313E-3,8.7605453397079935E-4]
[49,0.4402939263015051,0.92124314537417262,0.43177786819277614,0.43262200869755185,8.4414050477571098E-3,1,1,8.4414050477571098E-3,8.5911010010049772E-4]
[50,0.43177786819277553,0.91944559777344259,0.42342652561015015,0.42425433895445158,8.27813344301369E-3,1,1,8.27813344301369E-3,{"$f":"$B$397*$B452","v":8.424934013517571E-4}]
[]
[null,{"$f":"SUM(B401:B452)","v":36.809777669339915},null,null,null,null,null,null,{"$f":"SUM(INDEX(I403:I452,$B$399):I452)","v":0.57151914359628719},{"$f":"SUM(INDEX(J403:J452,$B$399):J452)","v":5.8165419842614467E-2}]